{"text_format":"1","workbook":"xlsx","n_sheets":15,"sheets":["Start","Award","Cert","Ext Cert","Diploma","Award Data Sheet","Award Dropdown","Cert Data Sheet","Cert Dropdown","Diploma Data Sheet","Diploma Dropdown","Ext Cert Data Sheet","Ext Cert Dropdown","Sectors","Points"],"not_rendered":{"charts":0,"images":1,"macros":1,"external_links":0,"defined_names":241,"comments":0,"pivot_tables":0},"unopened":[],"bounds":{"document_bytes":16777216,"sheet_cells":100000,"rows_first":2000,"rows_last":500,"rows_between":2000,"halvings":0,"cell_chars":16384,"cell_head_chars":4096},"cells_cut":0,"cells_raw":0,"read":"whole","date_system":"1900"}

{"sheet":"Start","index":0,"n_rows":19,"n_cols":10,"rows_kept":19,"cut":false,"hidden":false,"merged":[[18,2,21,13],[1,1,3,14],[5,2,7,6],[5,9,7,13],[10,2,12,6],[10,9,12,13]]}
[]
[null,"Select the size of qualification"]
[]
[]
[]
[null,null,"Diploma",null,null,null,null,null,null,"Extended Certificate"]
[]
[]
[]
[]
[null,null,"Certificate",null,null,null,null,null,null,"Award"]
[]
[]
[]
[]
[]
[]
[null,null,"Disclaimer: Please read carefully."]
[null,null,"Please remember that this tool is useful for calculating a learner's overall BTEC grade or helping to estimate a learner's achievement. It is NOT in any way a guarantee of any grade or outcome. "]

{"sheet":"Award","index":1,"n_rows":49,"n_cols":11,"rows_kept":49,"cut":false,"hidden":false,"merged":[]}
[]
[]
[]
[]
[]
[]
[null,null,"Assessment Type","Unit Number","Unit Name","GLH","Grade",null,"Points"]
[null,{"$f":"IFERROR(INDEX('Award Data Sheet'!$A$3:$F$990,SMALL(IF('Award Data Sheet'!$A$3:$A$990=$E$3,ROW('Award Data Sheet'!$A$3:$A$990)),ROW(1:1))-2,6),\"\")","v":0},{"$f":"IFERROR(INDEX('Award Data Sheet'!$A$3:$E$990,SMALL(IF('Award Data Sheet'!$A$3:$A$990=$E$3,ROW('Award Data Sheet'!$A$3:$A$990)),ROW(1:1))-2,5),\"\")","v":0},{"$f":"IFERROR(INDEX('Award Data Sheet'!$A$3:$E$990,SMALL(IF('Award Data Sheet'!$A$3:$A$990=$E$3,ROW('Award Data Sheet'!$A$3:$A$990)),ROW(1:1))-2,2),\"\")","v":0},{"$f":"IFERROR(INDEX('Award Data Sheet'!$A$3:$E$990,SMALL(IF('Award Data Sheet'!$A$3:$A$990=$E$3,ROW('Award Data Sheet'!$A$3:$A$990)),ROW(1:1))-2,3),\"\")","v":0},{"$f":"IFERROR(INDEX('Award Data Sheet'!$A$3:$E$990,SMALL(IF('Award Data Sheet'!$A$3:$A$990=$E$3,ROW('Award Data Sheet'!$A$3:$A$990)),ROW(1:1))-2,4),\"\")","v":0},null,{"$f":"IFERROR(IF(G8=\"\",\"\",VLOOKUP(G8,Points!$A$2:$B$6,2,FALSE)),\"\")","v":""},{"$f":"IFERROR(SUM(H8*(F8/10)),\"\")","v":""},{"$f":"IF(B8=\"Core\",I8,\"\")","v":""},{"$f":"IF(AND($E$3=\"Business 2018\",B8=\"Mandatory\"),I8,IF(AND($E$3=\"Construction and the Built Environment 2018\",B8=\"Mandatory\"),I8,IF(AND($E$3=\"Sport 2018\",B8=\"Mandatory\"),I8,IF(AND($E$3=\"Travel and Tourism 2018\",B8=\"Mandatory\"),I8,\"\"))))","v":""}]
[null,{"$f":"IFERROR(INDEX('Award Data Sheet'!$A$3:$F$990,SMALL(IF('Award Data Sheet'!$A$3:$A$990=$E$3,ROW('Award Data Sheet'!$A$3:$A$990)),ROW(2:2))-2,6),\"\")","v":0},{"$f":"IFERROR(INDEX('Award Data Sheet'!$A$3:$E$990,SMALL(IF('Award Data Sheet'!$A$3:$A$990=$E$3,ROW('Award Data Sheet'!$A$3:$A$990)),ROW(2:2))-2,5),\"\")","v":0},{"$f":"IFERROR(INDEX('Award Data Sheet'!$A$3:$E$990,SMALL(IF('Award Data Sheet'!$A$3:$A$990=$E$3,ROW('Award Data Sheet'!$A$3:$A$990)),ROW(2:2))-2,2),\"\")","v":0},{"$f":"IFERROR(INDEX('Award Data Sheet'!$A$3:$E$990,SMALL(IF('Award Data Sheet'!$A$3:$A$990=$E$3,ROW('Award Data Sheet'!$A$3:$A$990)),ROW(2:2))-2,3),\"\")","v":0},{"$f":"IFERROR(INDEX('Award Data Sheet'!$A$3:$E$990,SMALL(IF('Award Data Sheet'!$A$3:$A$990=$E$3,ROW('Award Data Sheet'!$A$3:$A$990)),ROW(2:2))-2,4),\"\")","v":0},null,{"$f":"IFERROR(IF(G9=\"\",\"\",VLOOKUP(G9,Points!$A$2:$B$6,2,FALSE)),\"\")","v":""},{"$f":"IFERROR(SUM(H9*(F9/10)),\"\")","v":""},{"$f":"IF(B9=\"Core\",I9,\"\")","v":""},{"$f":"IF(AND($E$3=\"Business 2018\",B9=\"Mandatory\"),I9,IF(AND($E$3=\"Construction and the Built Environment 2018\",B9=\"Mandatory\"),I9,IF(AND($E$3=\"Sport 2018\",B9=\"Mandatory\"),I9,IF(AND($E$3=\"Travel and Tourism 2018\",B9=\"Mandatory\"),I9,\"\"))))","v":""}]
[null,{"$f":"IFERROR(INDEX('Award Data Sheet'!$A$3:$F$990,SMALL(IF('Award Data Sheet'!$A$3:$A$990=$E$3,ROW('Award Data Sheet'!$A$3:$A$990)),ROW(3:3))-2,6),\"\")","v":0},{"$f":"IFERROR(INDEX('Award Data Sheet'!$A$3:$E$990,SMALL(IF('Award Data Sheet'!$A$3:$A$990=$E$3,ROW('Award Data Sheet'!$A$3:$A$990)),ROW(3:3))-2,5),\"\")","v":0},{"$f":"IFERROR(INDEX('Award Data Sheet'!$A$3:$E$990,SMALL(IF('Award Data Sheet'!$A$3:$A$990=$E$3,ROW('Award Data Sheet'!$A$3:$A$990)),ROW(3:3))-2,2),\"\")","v":0},{"$f":"IFERROR(INDEX('Award Data Sheet'!$A$3:$E$990,SMALL(IF('Award Data Sheet'!$A$3:$A$990=$E$3,ROW('Award Data Sheet'!$A$3:$A$990)),ROW(3:3))-2,3),\"\")","v":0},{"$f":"IFERROR(INDEX('Award Data Sheet'!$A$3:$E$990,SMALL(IF('Award Data Sheet'!$A$3:$A$990=$E$3,ROW('Award Data Sheet'!$A$3:$A$990)),ROW(3:3))-2,4),\"\")","v":0},null,{"$f":"IFERROR(IF(G10=\"\",\"\",VLOOKUP(G10,Points!$A$2:$B$6,2,FALSE)),\"\")","v":""},{"$f":"IFERROR(SUM(H10*(F10/10)),\"\")","v":""},"",""]
[null,{"$f":"IFERROR(INDEX('Award Data Sheet'!$A$3:$F$990,SMALL(IF('Award Data Sheet'!$A$3:$A$990=$E$3,ROW('Award Data Sheet'!$A$3:$A$990)),ROW(4:4))-2,6),\"\")","v":0},{"$f":"IFERROR(INDEX('Award Data Sheet'!$A$3:$E$990,SMALL(IF('Award Data Sheet'!$A$3:$A$990=$E$3,ROW('Award Data Sheet'!$A$3:$A$990)),ROW(4:4))-2,5),\"\")","v":0},{"$f":"IFERROR(INDEX('Award Data Sheet'!$A$3:$E$990,SMALL(IF('Award Data Sheet'!$A$3:$A$990=$E$3,ROW('Award Data Sheet'!$A$3:$A$990)),ROW(4:4))-2,2),\"\")","v":0},{"$f":"IFERROR(INDEX('Award Data Sheet'!$A$3:$E$990,SMALL(IF('Award Data Sheet'!$A$3:$A$990=$E$3,ROW('Award Data Sheet'!$A$3:$A$990)),ROW(4:4))-2,3),\"\")","v":0},{"$f":"IFERROR(INDEX('Award Data Sheet'!$A$3:$E$990,SMALL(IF('Award Data Sheet'!$A$3:$A$990=$E$3,ROW('Award Data Sheet'!$A$3:$A$990)),ROW(4:4))-2,4),\"\")","v":0},null,{"$f":"IFERROR(IF(G11=\"\",\"\",VLOOKUP(G11,Points!$A$2:$B$6,2,FALSE)),\"\")","v":""},"",""]
[null,{"$f":"IFERROR(INDEX('Award Data Sheet'!$A$3:$F$990,SMALL(IF('Award Data Sheet'!$A$3:$A$990=$E$3,ROW('Award Data Sheet'!$A$3:$A$990)),ROW(5:5))-2,6),\"\")","v":0},{"$f":"IFERROR(INDEX('Award Data Sheet'!$A$3:$E$990,SMALL(IF('Award Data Sheet'!$A$3:$A$990=$E$3,ROW('Award Data Sheet'!$A$3:$A$990)),ROW(5:5))-2,5),\"\")","v":0},{"$f":"IFERROR(INDEX('Award Data Sheet'!$A$3:$E$990,SMALL(IF('Award Data Sheet'!$A$3:$A$990=$E$3,ROW('Award Data Sheet'!$A$3:$A$990)),ROW(5:5))-2,2),\"\")","v":0},{"$f":"IFERROR(INDEX('Award Data Sheet'!$A$3:$E$990,SMALL(IF('Award Data Sheet'!$A$3:$A$990=$E$3,ROW('Award Data Sheet'!$A$3:$A$990)),ROW(5:5))-2,3),\"\")","v":0},{"$f":"IFERROR(INDEX('Award Data Sheet'!$A$3:$E$990,SMALL(IF('Award Data Sheet'!$A$3:$A$990=$E$3,ROW('Award Data Sheet'!$A$3:$A$990)),ROW(5:5))-2,4),\"\")","v":0},null,{"$f":"IFERROR(IF(G12=\"\",\"\",VLOOKUP(G12,Points!$A$2:$B$6,2,FALSE)),\"\")","v":""},"",""]
[null,{"$f":"IFERROR(INDEX('Award Data Sheet'!$A$3:$F$990,SMALL(IF('Award Data Sheet'!$A$3:$A$990=$E$3,ROW('Award Data Sheet'!$A$3:$A$990)),ROW(6:6))-2,6),\"\")","v":0},{"$f":"IFERROR(INDEX('Award Data Sheet'!$A$3:$E$990,SMALL(IF('Award Data Sheet'!$A$3:$A$990=$E$3,ROW('Award Data Sheet'!$A$3:$A$990)),ROW(6:6))-2,5),\"\")","v":0},{"$f":"IFERROR(INDEX('Award Data Sheet'!$A$3:$E$990,SMALL(IF('Award Data Sheet'!$A$3:$A$990=$E$3,ROW('Award Data Sheet'!$A$3:$A$990)),ROW(6:6))-2,2),\"\")","v":0},{"$f":"IFERROR(INDEX('Award Data Sheet'!$A$3:$E$990,SMALL(IF('Award Data Sheet'!$A$3:$A$990=$E$3,ROW('Award Data Sheet'!$A$3:$A$990)),ROW(6:6))-2,3),\"\")","v":0},{"$f":"IFERROR(INDEX('Award Data Sheet'!$A$3:$E$990,SMALL(IF('Award Data Sheet'!$A$3:$A$990=$E$3,ROW('Award Data Sheet'!$A$3:$A$990)),ROW(6:6))-2,4),\"\")","v":0},null,{"$f":"IFERROR(IF(G13=\"\",\"\",VLOOKUP(G13,Points!$A$2:$B$6,2,FALSE)),\"\")","v":""},"",""]
[null,{"$f":"IFERROR(INDEX('Award Data Sheet'!$A$3:$F$990,SMALL(IF('Award Data Sheet'!$A$3:$A$990=$E$3,ROW('Award Data Sheet'!$A$3:$A$990)),ROW(7:7))-2,6),\"\")","v":0},{"$f":"IFERROR(INDEX('Award Data Sheet'!$A$3:$E$990,SMALL(IF('Award Data Sheet'!$A$3:$A$990=$E$3,ROW('Award Data Sheet'!$A$3:$A$990)),ROW(7:7))-2,5),\"\")","v":0},{"$f":"IFERROR(INDEX('Award Data Sheet'!$A$3:$E$990,SMALL(IF('Award Data Sheet'!$A$3:$A$990=$E$3,ROW('Award Data Sheet'!$A$3:$A$990)),ROW(7:7))-2,2),\"\")","v":0},{"$f":"IFERROR(INDEX('Award Data Sheet'!$A$3:$E$990,SMALL(IF('Award Data Sheet'!$A$3:$A$990=$E$3,ROW('Award Data Sheet'!$A$3:$A$990)),ROW(7:7))-2,3),\"\")","v":0},{"$f":"IFERROR(INDEX('Award Data Sheet'!$A$3:$E$990,SMALL(IF('Award Data Sheet'!$A$3:$A$990=$E$3,ROW('Award Data Sheet'!$A$3:$A$990)),ROW(7:7))-2,4),\"\")","v":0},null,{"$f":"IFERROR(IF(G14=\"\",\"\",VLOOKUP(G14,Points!$A$2:$B$6,2,FALSE)),\"\")","v":""},"",""]
[null,{"$f":"IFERROR(INDEX('Award Data Sheet'!$A$3:$F$990,SMALL(IF('Award Data Sheet'!$A$3:$A$990=$E$3,ROW('Award Data Sheet'!$A$3:$A$990)),ROW(8:8))-2,6),\"\")","v":0},{"$f":"IFERROR(INDEX('Award Data Sheet'!$A$3:$E$990,SMALL(IF('Award Data Sheet'!$A$3:$A$990=$E$3,ROW('Award Data Sheet'!$A$3:$A$990)),ROW(8:8))-2,5),\"\")","v":0},{"$f":"IFERROR(INDEX('Award Data Sheet'!$A$3:$E$990,SMALL(IF('Award Data Sheet'!$A$3:$A$990=$E$3,ROW('Award Data Sheet'!$A$3:$A$990)),ROW(8:8))-2,2),\"\")","v":0},{"$f":"IFERROR(INDEX('Award Data Sheet'!$A$3:$E$990,SMALL(IF('Award Data Sheet'!$A$3:$A$990=$E$3,ROW('Award Data Sheet'!$A$3:$A$990)),ROW(8:8))-2,3),\"\")","v":0},{"$f":"IFERROR(INDEX('Award Data Sheet'!$A$3:$E$990,SMALL(IF('Award Data Sheet'!$A$3:$A$990=$E$3,ROW('Award Data Sheet'!$A$3:$A$990)),ROW(8:8))-2,4),\"\")","v":0},null,{"$f":"IFERROR(IF(G15=\"\",\"\",VLOOKUP(G15,Points!$A$2:$B$6,2,FALSE)),\"\")","v":""},"",""]
[null,{"$f":"IFERROR(INDEX('Award Data Sheet'!$A$3:$F$990,SMALL(IF('Award Data Sheet'!$A$3:$A$990=$E$3,ROW('Award Data Sheet'!$A$3:$A$990)),ROW(9:9))-2,6),\"\")","v":0},{"$f":"IFERROR(INDEX('Award Data Sheet'!$A$3:$E$990,SMALL(IF('Award Data Sheet'!$A$3:$A$990=$E$3,ROW('Award Data Sheet'!$A$3:$A$990)),ROW(9:9))-2,5),\"\")","v":0},{"$f":"IFERROR(INDEX('Award Data Sheet'!$A$3:$E$990,SMALL(IF('Award Data Sheet'!$A$3:$A$990=$E$3,ROW('Award Data Sheet'!$A$3:$A$990)),ROW(9:9))-2,2),\"\")","v":0},{"$f":"IFERROR(INDEX('Award Data Sheet'!$A$3:$E$990,SMALL(IF('Award Data Sheet'!$A$3:$A$990=$E$3,ROW('Award Data Sheet'!$A$3:$A$990)),ROW(9:9))-2,3),\"\")","v":0},{"$f":"IFERROR(INDEX('Award Data Sheet'!$A$3:$E$990,SMALL(IF('Award Data Sheet'!$A$3:$A$990=$E$3,ROW('Award Data Sheet'!$A$3:$A$990)),ROW(9:9))-2,4),\"\")","v":0},null,{"$f":"IFERROR(IF(G16=\"\",\"\",VLOOKUP(G16,Points!$A$2:$B$6,2,FALSE)),\"\")","v":""},"",""]
[null,{"$f":"IFERROR(INDEX('Award Data Sheet'!$A$3:$F$990,SMALL(IF('Award Data Sheet'!$A$3:$A$990=$E$3,ROW('Award Data Sheet'!$A$3:$A$990)),ROW(10:10))-2,6),\"\")","v":0},{"$f":"IFERROR(INDEX('Award Data Sheet'!$A$3:$E$990,SMALL(IF('Award Data Sheet'!$A$3:$A$990=$E$3,ROW('Award Data Sheet'!$A$3:$A$990)),ROW(10:10))-2,5),\"\")","v":0},{"$f":"IFERROR(INDEX('Award Data Sheet'!$A$3:$E$990,SMALL(IF('Award Data Sheet'!$A$3:$A$990=$E$3,ROW('Award Data Sheet'!$A$3:$A$990)),ROW(10:10))-2,2),\"\")","v":0},{"$f":"IFERROR(INDEX('Award Data Sheet'!$A$3:$E$990,SMALL(IF('Award Data Sheet'!$A$3:$A$990=$E$3,ROW('Award Data Sheet'!$A$3:$A$990)),ROW(10:10))-2,3),\"\")","v":0},{"$f":"IFERROR(INDEX('Award Data Sheet'!$A$3:$E$990,SMALL(IF('Award Data Sheet'!$A$3:$A$990=$E$3,ROW('Award Data Sheet'!$A$3:$A$990)),ROW(10:10))-2,4),\"\")","v":0},null,{"$f":"IFERROR(IF(G17=\"\",\"\",VLOOKUP(G17,Points!$A$2:$B$6,2,FALSE)),\"\")","v":""},"",""]
[null,null,null,null,null,{"$f":"SUM(F8:F17)","v":0},null,null,null,{"$f":"SUM(J8:J17)","v":0},{"$f":"SUM(K8:K10)","v":0}]
[null,"Choose one optional unit"]
[null,"Optional",{"$f":"IFERROR(INDEX('Award Data Sheet'!$L$3:$L$990,MATCH(Award!E20&$E$3,'Award Data Sheet'!$G$3:$G$990&'Award Data Sheet'!$H$3:$H$990,0)),\"\")","v":0},{"$f":"IFERROR(INDEX('Award Data Sheet'!$I$3:$I$990,MATCH(Award!E20&$E$3,'Award Data Sheet'!$G$3:$G$990&'Award Data Sheet'!$H$3:$H$990,0)),\"\")","v":0},null,{"$f":"IFERROR(INDEX('Award Data Sheet'!$K$3:$K$990,MATCH(Award!E20&$E$3,'Award Data Sheet'!$G$3:$G$990&'Award Data Sheet'!$H$3:$H$990,0)),\"\")","v":0},null,{"$f":"IFERROR(IF(G20=\"\",\"\",VLOOKUP(G20,Points!$A$2:$B$6,2,FALSE)),\"\")","v":""},{"$f":"IFERROR(SUM(H20*(F20/10)),\"\")","v":""}]
[null,"Optional",{"$f":"IFERROR(INDEX('Award Data Sheet'!$L$3:$L$990,MATCH(Award!E21&$E$3,'Award Data Sheet'!$G$3:$G$990&'Award Data Sheet'!$H$3:$H$990,0)),\"\")","v":0},{"$f":"IFERROR(INDEX('Award Data Sheet'!$I$3:$I$990,MATCH(Award!E21&$E$3,'Award Data Sheet'!$G$3:$G$990&'Award Data Sheet'!$H$3:$H$990,0)),\"\")","v":0},null,{"$f":"IFERROR(INDEX('Award Data Sheet'!$K$3:$K$990,MATCH(Award!E21&$E$3,'Award Data Sheet'!$G$3:$G$990&'Award Data Sheet'!$H$3:$H$990,0)),\"\")","v":0},null,{"$f":"IFERROR(IF(G21=\"\",\"\",VLOOKUP(G21,Points!$A$2:$B$6,2,FALSE)),\"\")","v":""},""]
[null,"Optional",{"$f":"IFERROR(INDEX('Award Data Sheet'!$L$3:$L$990,MATCH(Award!E22&$E$3,'Award Data Sheet'!$G$3:$G$990&'Award Data Sheet'!$H$3:$H$990,0)),\"\")","v":0},{"$f":"IFERROR(INDEX('Award Data Sheet'!$I$3:$I$990,MATCH(Award!E22&$E$3,'Award Data Sheet'!$G$3:$G$990&'Award Data Sheet'!$H$3:$H$990,0)),\"\")","v":0},null,{"$f":"IFERROR(INDEX('Award Data Sheet'!$K$3:$K$990,MATCH(Award!E22&$E$3,'Award Data Sheet'!$G$3:$G$990&'Award Data Sheet'!$H$3:$H$990,0)),\"\")","v":0},null,{"$f":"IFERROR(IF(G22=\"\",\"\",VLOOKUP(G22,Points!$A$2:$B$6,2,FALSE)),\"\")","v":""},""]
[null,"Optional",{"$f":"IFERROR(INDEX('Award Data Sheet'!$L$3:$L$990,MATCH(Award!E23&$E$3,'Award Data Sheet'!$G$3:$G$990&'Award Data Sheet'!$H$3:$H$990,0)),\"\")","v":0},{"$f":"IFERROR(INDEX('Award Data Sheet'!$I$3:$I$990,MATCH(Award!E23&$E$3,'Award Data Sheet'!$G$3:$G$990&'Award Data Sheet'!$H$3:$H$990,0)),\"\")","v":0},null,{"$f":"IFERROR(INDEX('Award Data Sheet'!$K$3:$K$990,MATCH(Award!E23&$E$3,'Award Data Sheet'!$G$3:$G$990&'Award Data Sheet'!$H$3:$H$990,0)),\"\")","v":0},null,{"$f":"IFERROR(IF(G23=\"\",\"\",VLOOKUP(G23,Points!$A$2:$B$6,2,FALSE)),\"\")","v":""},""]
[null,"Optional",{"$f":"IFERROR(INDEX('Award Data Sheet'!$L$3:$L$990,MATCH(Award!E24&$E$3,'Award Data Sheet'!$G$3:$G$990&'Award Data Sheet'!$H$3:$H$990,0)),\"\")","v":0},{"$f":"IFERROR(INDEX('Award Data Sheet'!$I$3:$I$990,MATCH(Award!E24&$E$3,'Award Data Sheet'!$G$3:$G$990&'Award Data Sheet'!$H$3:$H$990,0)),\"\")","v":0},null,{"$f":"IFERROR(INDEX('Award Data Sheet'!$K$3:$K$990,MATCH(Award!E24&$E$3,'Award Data Sheet'!$G$3:$G$990&'Award Data Sheet'!$H$3:$H$990,0)),\"\")","v":0},null,{"$f":"IFERROR(IF(G24=\"\",\"\",VLOOKUP(G24,Points!$A$2:$B$6,2,FALSE)),\"\")","v":""},""]
[null,"Optional",{"$f":"IFERROR(INDEX('Award Data Sheet'!$L$3:$L$990,MATCH(Award!E25&$E$3,'Award Data Sheet'!$G$3:$G$990&'Award Data Sheet'!$H$3:$H$990,0)),\"\")","v":0},{"$f":"IFERROR(INDEX('Award Data Sheet'!$I$3:$I$990,MATCH(Award!E25&$E$3,'Award Data Sheet'!$G$3:$G$990&'Award Data Sheet'!$H$3:$H$990,0)),\"\")","v":0},null,{"$f":"IFERROR(INDEX('Award Data Sheet'!$K$3:$K$990,MATCH(Award!E25&$E$3,'Award Data Sheet'!$G$3:$G$990&'Award Data Sheet'!$H$3:$H$990,0)),\"\")","v":0},null,{"$f":"IFERROR(IF(G25=\"\",\"\",VLOOKUP(G25,Points!$A$2:$B$6,2,FALSE)),\"\")","v":""},""]
[null,"Optional",{"$f":"IFERROR(INDEX('Award Data Sheet'!$L$3:$L$990,MATCH(Award!E26&$E$3,'Award Data Sheet'!$G$3:$G$990&'Award Data Sheet'!$H$3:$H$990,0)),\"\")","v":0},{"$f":"IFERROR(INDEX('Award Data Sheet'!$I$3:$I$990,MATCH(Award!E26&$E$3,'Award Data Sheet'!$G$3:$G$990&'Award Data Sheet'!$H$3:$H$990,0)),\"\")","v":0},null,{"$f":"IFERROR(INDEX('Award Data Sheet'!$K$3:$K$990,MATCH(Award!E26&$E$3,'Award Data Sheet'!$G$3:$G$990&'Award Data Sheet'!$H$3:$H$990,0)),\"\")","v":0},null,{"$f":"IFERROR(IF(G26=\"\",\"\",VLOOKUP(G26,Points!$A$2:$B$6,2,FALSE)),\"\")","v":""},""]
[null,"Optional",{"$f":"IFERROR(INDEX('Award Data Sheet'!$L$3:$L$990,MATCH(Award!E27&$E$3,'Award Data Sheet'!$G$3:$G$990&'Award Data Sheet'!$H$3:$H$990,0)),\"\")","v":0},{"$f":"IFERROR(INDEX('Award Data Sheet'!$I$3:$I$990,MATCH(Award!E27&$E$3,'Award Data Sheet'!$G$3:$G$990&'Award Data Sheet'!$H$3:$H$990,0)),\"\")","v":0},null,{"$f":"IFERROR(INDEX('Award Data Sheet'!$K$3:$K$990,MATCH(Award!E27&$E$3,'Award Data Sheet'!$G$3:$G$990&'Award Data Sheet'!$H$3:$H$990,0)),\"\")","v":0},null,{"$f":"IFERROR(IF(G27=\"\",\"\",VLOOKUP(G27,Points!$A$2:$B$6,2,FALSE)),\"\")","v":""},""]
[null,"Optional",{"$f":"IFERROR(INDEX('Award Data Sheet'!$L$3:$L$990,MATCH(Award!E28&$E$3,'Award Data Sheet'!$G$3:$G$990&'Award Data Sheet'!$H$3:$H$990,0)),\"\")","v":0},{"$f":"IFERROR(INDEX('Award Data Sheet'!$I$3:$I$990,MATCH(Award!E28&$E$3,'Award Data Sheet'!$G$3:$G$990&'Award Data Sheet'!$H$3:$H$990,0)),\"\")","v":0},null,{"$f":"IFERROR(INDEX('Award Data Sheet'!$K$3:$K$990,MATCH(Award!E28&$E$3,'Award Data Sheet'!$G$3:$G$990&'Award Data Sheet'!$H$3:$H$990,0)),\"\")","v":0},null,{"$f":"IFERROR(IF(G28=\"\",\"\",VLOOKUP(G28,Points!$A$2:$B$6,2,FALSE)),\"\")","v":""},""]
[null,"Optional",{"$f":"IFERROR(INDEX('Award Data Sheet'!$L$3:$L$990,MATCH(Award!E29&$E$3,'Award Data Sheet'!$G$3:$G$990&'Award Data Sheet'!$H$3:$H$990,0)),\"\")","v":0},{"$f":"IFERROR(INDEX('Award Data Sheet'!$I$3:$I$990,MATCH(Award!E29&$E$3,'Award Data Sheet'!$G$3:$G$990&'Award Data Sheet'!$H$3:$H$990,0)),\"\")","v":0},null,{"$f":"IFERROR(INDEX('Award Data Sheet'!$K$3:$K$990,MATCH(Award!E29&$E$3,'Award Data Sheet'!$G$3:$G$990&'Award Data Sheet'!$H$3:$H$990,0)),\"\")","v":0},null,{"$f":"IFERROR(IF(G29=\"\",\"\",VLOOKUP(G29,Points!$A$2:$B$6,2,FALSE)),\"\")","v":""},""]
[null,null,null,null,null,{"$f":"SUM(F20:F29)","v":0}]
[null,"Choose a maximum of one unit from Group B"]
[null,"Optional",{"$f":"IFERROR(INDEX('Award Data Sheet'!$S$3:$S$990,MATCH(Award!E32&$E$3,'Award Data Sheet'!$N$3:$N$990&'Award Data Sheet'!$O$3:$O$990,0)),\"\")","v":0},{"$f":"IFERROR(INDEX('Award Data Sheet'!$P$3:$P$990,MATCH(Award!E32&$E$3,'Award Data Sheet'!$N$3:$N$990&'Award Data Sheet'!$O$3:$O$990,0)),\"\")","v":0},null,{"$f":"IFERROR(INDEX('Award Data Sheet'!$R$3:$R$990,MATCH(Award!E32&$E$3,'Award Data Sheet'!$N$3:$N$990&'Award Data Sheet'!$O$3:$O$990,0)),\"\")","v":0},null,{"$f":"IFERROR(IF(G32=\"\",\"\",VLOOKUP(G32,Points!$A$2:$B$6,2,FALSE)),\"\")","v":""},{"$f":"IFERROR(SUM(H32*(F32/10)),\"\")","v":""}]
[null,"Optional",{"$f":"IFERROR(INDEX('Award Data Sheet'!$S$3:$S$990,MATCH(Award!E33&$E$3,'Award Data Sheet'!$N$3:$N$990&'Award Data Sheet'!$O$3:$O$990,0)),\"\")","v":0},{"$f":"IFERROR(INDEX('Award Data Sheet'!$P$3:$P$990,MATCH(Award!E33&$E$3,'Award Data Sheet'!$N$3:$N$990&'Award Data Sheet'!$O$3:$O$990,0)),\"\")","v":0},null,{"$f":"IFERROR(INDEX('Award Data Sheet'!$R$3:$R$990,MATCH(Award!E33&$E$3,'Award Data Sheet'!$N$3:$N$990&'Award Data Sheet'!$O$3:$O$990,0)),\"\")","v":0},null,{"$f":"IFERROR(IF(G33=\"\",\"\",VLOOKUP(G33,Points!$A$2:$B$6,2,FALSE)),\"\")","v":""},""]
[null,"Optional",{"$f":"IFERROR(INDEX('Award Data Sheet'!$S$3:$S$990,MATCH(Award!E34&$E$3,'Award Data Sheet'!$N$3:$N$990&'Award Data Sheet'!$O$3:$O$990,0)),\"\")","v":0},{"$f":"IFERROR(INDEX('Award Data Sheet'!$P$3:$P$990,MATCH(Award!E34&$E$3,'Award Data Sheet'!$N$3:$N$990&'Award Data Sheet'!$O$3:$O$990,0)),\"\")","v":0},null,{"$f":"IFERROR(INDEX('Award Data Sheet'!$R$3:$R$990,MATCH(Award!E34&$E$3,'Award Data Sheet'!$N$3:$N$990&'Award Data Sheet'!$O$3:$O$990,0)),\"\")","v":0},null,{"$f":"IFERROR(IF(G34=\"\",\"\",VLOOKUP(G34,Points!$A$2:$B$6,2,FALSE)),\"\")","v":""},""]
[null,"Optional",{"$f":"IFERROR(INDEX('Award Data Sheet'!$S$3:$S$990,MATCH(Award!E35&$E$3,'Award Data Sheet'!$N$3:$N$990&'Award Data Sheet'!$O$3:$O$990,0)),\"\")","v":0},{"$f":"IFERROR(INDEX('Award Data Sheet'!$P$3:$P$990,MATCH(Award!E35&$E$3,'Award Data Sheet'!$N$3:$N$990&'Award Data Sheet'!$O$3:$O$990,0)),\"\")","v":0},null,{"$f":"IFERROR(INDEX('Award Data Sheet'!$R$3:$R$990,MATCH(Award!E35&$E$3,'Award Data Sheet'!$N$3:$N$990&'Award Data Sheet'!$O$3:$O$990,0)),\"\")","v":0},null,{"$f":"IFERROR(IF(G35=\"\",\"\",VLOOKUP(G35,Points!$A$2:$B$6,2,FALSE)),\"\")","v":""},""]
[null,"Optional",{"$f":"IFERROR(INDEX('Award Data Sheet'!$S$3:$S$990,MATCH(Award!E36&$E$3,'Award Data Sheet'!$N$3:$N$990&'Award Data Sheet'!$O$3:$O$990,0)),\"\")","v":0},{"$f":"IFERROR(INDEX('Award Data Sheet'!$P$3:$P$990,MATCH(Award!E36&$E$3,'Award Data Sheet'!$N$3:$N$990&'Award Data Sheet'!$O$3:$O$990,0)),\"\")","v":0},null,{"$f":"IFERROR(INDEX('Award Data Sheet'!$R$3:$R$990,MATCH(Award!E36&$E$3,'Award Data Sheet'!$N$3:$N$990&'Award Data Sheet'!$O$3:$O$990,0)),\"\")","v":0},null,{"$f":"IFERROR(IF(G36=\"\",\"\",VLOOKUP(G36,Points!$A$2:$B$6,2,FALSE)),\"\")","v":""},""]
[null,"Optional",{"$f":"IFERROR(INDEX('Award Data Sheet'!$S$3:$S$990,MATCH(Award!E37&$E$3,'Award Data Sheet'!$N$3:$N$990&'Award Data Sheet'!$O$3:$O$990,0)),\"\")","v":0},{"$f":"IFERROR(INDEX('Award Data Sheet'!$P$3:$P$990,MATCH(Award!E37&$E$3,'Award Data Sheet'!$N$3:$N$990&'Award Data Sheet'!$O$3:$O$990,0)),\"\")","v":0},null,{"$f":"IFERROR(INDEX('Award Data Sheet'!$R$3:$R$990,MATCH(Award!E37&$E$3,'Award Data Sheet'!$N$3:$N$990&'Award Data Sheet'!$O$3:$O$990,0)),\"\")","v":0},null,{"$f":"IFERROR(IF(G37=\"\",\"\",VLOOKUP(G37,Points!$A$2:$B$6,2,FALSE)),\"\")","v":""},""]
[null,"Optional",{"$f":"IFERROR(INDEX('Award Data Sheet'!$S$3:$S$990,MATCH(Award!E38&$E$3,'Award Data Sheet'!$N$3:$N$990&'Award Data Sheet'!$O$3:$O$990,0)),\"\")","v":0},{"$f":"IFERROR(INDEX('Award Data Sheet'!$P$3:$P$990,MATCH(Award!E38&$E$3,'Award Data Sheet'!$N$3:$N$990&'Award Data Sheet'!$O$3:$O$990,0)),\"\")","v":0},null,{"$f":"IFERROR(INDEX('Award Data Sheet'!$R$3:$R$990,MATCH(Award!E38&$E$3,'Award Data Sheet'!$N$3:$N$990&'Award Data Sheet'!$O$3:$O$990,0)),\"\")","v":0},null,{"$f":"IFERROR(IF(G38=\"\",\"\",VLOOKUP(G38,Points!$A$2:$B$6,2,FALSE)),\"\")","v":""},""]
[null,"Optional",{"$f":"IFERROR(INDEX('Award Data Sheet'!$S$3:$S$990,MATCH(Award!E39&$E$3,'Award Data Sheet'!$N$3:$N$990&'Award Data Sheet'!$O$3:$O$990,0)),\"\")","v":0},{"$f":"IFERROR(INDEX('Award Data Sheet'!$P$3:$P$990,MATCH(Award!E39&$E$3,'Award Data Sheet'!$N$3:$N$990&'Award Data Sheet'!$O$3:$O$990,0)),\"\")","v":0},null,{"$f":"IFERROR(INDEX('Award Data Sheet'!$R$3:$R$990,MATCH(Award!E39&$E$3,'Award Data Sheet'!$N$3:$N$990&'Award Data Sheet'!$O$3:$O$990,0)),\"\")","v":0},null,{"$f":"IFERROR(IF(G39=\"\",\"\",VLOOKUP(G39,Points!$A$2:$B$6,2,FALSE)),\"\")","v":""},""]
[null,"Optional",{"$f":"IFERROR(INDEX('Award Data Sheet'!$S$3:$S$990,MATCH(Award!E40&$E$3,'Award Data Sheet'!$N$3:$N$990&'Award Data Sheet'!$O$3:$O$990,0)),\"\")","v":0},{"$f":"IFERROR(INDEX('Award Data Sheet'!$P$3:$P$990,MATCH(Award!E40&$E$3,'Award Data Sheet'!$N$3:$N$990&'Award Data Sheet'!$O$3:$O$990,0)),\"\")","v":0},null,{"$f":"IFERROR(INDEX('Award Data Sheet'!$R$3:$R$990,MATCH(Award!E40&$E$3,'Award Data Sheet'!$N$3:$N$990&'Award Data Sheet'!$O$3:$O$990,0)),\"\")","v":0},null,{"$f":"IFERROR(IF(G40=\"\",\"\",VLOOKUP(G40,Points!$A$2:$B$6,2,FALSE)),\"\")","v":""},""]
[null,"Optional",{"$f":"IFERROR(INDEX('Award Data Sheet'!$S$3:$S$990,MATCH(Award!E41&$E$3,'Award Data Sheet'!$N$3:$N$990&'Award Data Sheet'!$O$3:$O$990,0)),\"\")","v":0},{"$f":"IFERROR(INDEX('Award Data Sheet'!$P$3:$P$990,MATCH(Award!E41&$E$3,'Award Data Sheet'!$N$3:$N$990&'Award Data Sheet'!$O$3:$O$990,0)),\"\")","v":0},null,{"$f":"IFERROR(INDEX('Award Data Sheet'!$R$3:$R$990,MATCH(Award!E41&$E$3,'Award Data Sheet'!$N$3:$N$990&'Award Data Sheet'!$O$3:$O$990,0)),\"\")","v":0},null,{"$f":"IFERROR(IF(G41=\"\",\"\",VLOOKUP(G41,Points!$A$2:$B$6,2,FALSE)),\"\")","v":""},""]
[null,null,null,null,null,{"$f":"SUM(F32:F41)","v":0}]
[null,null,null,null,null,{"$f":"SUM(F18+F30+F42)","v":0},"Overall Grade",null,{"$f":"IF($E$3=\"Application of Science\",VLOOKUP(Award!I44,Points!$E$2:$F$7,2,TRUE),IF(Award!$E$3=\"Principles of Applied Science\",VLOOKUP(Award!I44,Points!$E$2:$F$7,2,TRUE),IF($E$3=\"CPLD\",$J$49,IF(OR(Award!$E$3=\"Business 2018\",$E$3=\"Construction and the Built Environment 2018\",$E$3=\"Travel and Tourism 2018\",Award!$E$3=\"Sport 2018\"),Award!J48,Award!J47))))","v":"U"}]
[null,null,null,null,null,null,"Points",null,{"$f":"SUM(I8:I41)","v":0}]
[]
[]
[null,null,null,null,null,null,null,null,{"$f":"IF(AND(J18>11,J18<24),\"Level 1\",IF(J18>=24,\"Level 2\",IF(J18<12,\"U\",\"\")))","v":"U"},{"$f":"IF(I47=\"Level 2\",VLOOKUP(I44,Points!$E$2:$F$7,2,TRUE),IF(Award!I47=\"Level 1\",VLOOKUP(I44,Points!$E$2:$F$3,2,TRUE),IF(Award!I47=\"U\",\"U\",\"\")))","v":"U"}]
[null,null,null,null,null,null,null,null,{"$f":"IF(AND(OR(E3=\"Business 2018\",E3=\"Construction and the Built Environment 2018\",E3=\"Sport 2018\",E3=\"Travel and Tourism 2018\"),K18<24,K18>11),\"Level 1\",IF(AND(OR(E3=\"Business 2018\",E3=\"Construction and the Built Environment 2018\",E3=\"Sport 2018\",E3=\"Travel and Tourism 2018\"),K18<12),\"U\",\"Level 2\"))","v":"Level 2"},{"$f":"IF(I48=\"Level 2\",VLOOKUP(I44,Points!$E$2:$F$7,2,TRUE),IF(AND(Award!I48=\"Level 1\",I44<24),\"U\",IF(AND(Award!I48=\"Level 1\",I44>23),\"Level 1 Pass\",IF(Award!I48=\"U\",\"U\",\"\"))))","v":"U"}]
[null,null,null,null,null,null,null,null,null,{"$f":"IF(AND(E3=\"CPLD\",I8=0),\"U\",VLOOKUP(I44,Points!E2:F7,2,TRUE))","v":"U"}]

{"sheet":"Cert","index":2,"n_rows":44,"n_cols":9,"rows_kept":44,"cut":false,"hidden":false,"merged":[]}
[]
[]
[]
[]
[]
[]
[null,null,"Assessment Type","Unit Number","Unit Name","GLH","Grade",null,"Points"]
[null,"Mandatory",{"$f":"IFERROR(INDEX('Cert Data Sheet'!$A$3:$E$990,SMALL(IF('Cert Data Sheet'!$A$3:$A$990=$E$3,ROW('Cert Data Sheet'!$A$3:$A$990)),ROW(1:1))-2,5),\"\")","v":0},{"$f":"IFERROR(INDEX('Cert Data Sheet'!$A$3:$E$990,SMALL(IF('Cert Data Sheet'!$A$3:$A$990=$E$3,ROW('Cert Data Sheet'!$A$3:$A$990)),ROW(1:1))-2,2),\"\")","v":0},{"$f":"IFERROR(INDEX('Cert Data Sheet'!$A$3:$E$990,SMALL(IF('Cert Data Sheet'!$A$3:$A$990=$E$3,ROW('Cert Data Sheet'!$A$3:$A$990)),ROW(1:1))-2,3),\"\")","v":0},{"$f":"IFERROR(INDEX('Cert Data Sheet'!$A$3:$E$990,SMALL(IF('Cert Data Sheet'!$A$3:$A$990=$E$3,ROW('Cert Data Sheet'!$A$3:$A$990)),ROW(1:1))-2,4),\"\")","v":0},null,{"$f":"IFERROR(IF(G8=\"\",\"\",VLOOKUP(G8,Points!$A$2:$B$6,2,FALSE)),\"\")","v":""},{"$f":"IFERROR(SUM(H8*(F8/10)),\"\")","v":""}]
[null,"Mandatory",{"$f":"IFERROR(INDEX('Cert Data Sheet'!$A$3:$E$990,SMALL(IF('Cert Data Sheet'!$A$3:$A$990=$E$3,ROW('Cert Data Sheet'!$A$3:$A$990)),ROW(2:2))-2,5),\"\")","v":0},{"$f":"IFERROR(INDEX('Cert Data Sheet'!$A$3:$E$990,SMALL(IF('Cert Data Sheet'!$A$3:$A$990=$E$3,ROW('Cert Data Sheet'!$A$3:$A$990)),ROW(2:2))-2,2),\"\")","v":0},{"$f":"IFERROR(INDEX('Cert Data Sheet'!$A$3:$E$990,SMALL(IF('Cert Data Sheet'!$A$3:$A$990=$E$3,ROW('Cert Data Sheet'!$A$3:$A$990)),ROW(2:2))-2,3),\"\")","v":0},{"$f":"IFERROR(INDEX('Cert Data Sheet'!$A$3:$E$990,SMALL(IF('Cert Data Sheet'!$A$3:$A$990=$E$3,ROW('Cert Data Sheet'!$A$3:$A$990)),ROW(2:2))-2,4),\"\")","v":0},null,{"$f":"IFERROR(IF(G9=\"\",\"\",VLOOKUP(G9,Points!$A$2:$B$6,2,FALSE)),\"\")","v":""},{"$f":"IFERROR(SUM(H9*(F9/10)),\"\")","v":""}]
[null,"Mandatory",{"$f":"IFERROR(INDEX('Cert Data Sheet'!$A$3:$E$990,SMALL(IF('Cert Data Sheet'!$A$3:$A$990=$E$3,ROW('Cert Data Sheet'!$A$3:$A$990)),ROW(3:3))-2,5),\"\")","v":0},{"$f":"IFERROR(INDEX('Cert Data Sheet'!$A$3:$E$990,SMALL(IF('Cert Data Sheet'!$A$3:$A$990=$E$3,ROW('Cert Data Sheet'!$A$3:$A$990)),ROW(3:3))-2,2),\"\")","v":0},{"$f":"IFERROR(INDEX('Cert Data Sheet'!$A$3:$E$990,SMALL(IF('Cert Data Sheet'!$A$3:$A$990=$E$3,ROW('Cert Data Sheet'!$A$3:$A$990)),ROW(3:3))-2,3),\"\")","v":0},{"$f":"IFERROR(INDEX('Cert Data Sheet'!$A$3:$E$990,SMALL(IF('Cert Data Sheet'!$A$3:$A$990=$E$3,ROW('Cert Data Sheet'!$A$3:$A$990)),ROW(3:3))-2,4),\"\")","v":0},null,{"$f":"IFERROR(IF(G10=\"\",\"\",VLOOKUP(G10,Points!$A$2:$B$6,2,FALSE)),\"\")","v":""},{"$f":"IFERROR(SUM(H10*(F10/10)),\"\")","v":""}]
[null,"Mandatory",{"$f":"IFERROR(INDEX('Cert Data Sheet'!$A$3:$E$990,SMALL(IF('Cert Data Sheet'!$A$3:$A$990=$E$3,ROW('Cert Data Sheet'!$A$3:$A$990)),ROW(4:4))-2,5),\"\")","v":0},{"$f":"IFERROR(INDEX('Cert Data Sheet'!$A$3:$E$990,SMALL(IF('Cert Data Sheet'!$A$3:$A$990=$E$3,ROW('Cert Data Sheet'!$A$3:$A$990)),ROW(4:4))-2,2),\"\")","v":0},{"$f":"IFERROR(INDEX('Cert Data Sheet'!$A$3:$E$990,SMALL(IF('Cert Data Sheet'!$A$3:$A$990=$E$3,ROW('Cert Data Sheet'!$A$3:$A$990)),ROW(4:4))-2,3),\"\")","v":0},{"$f":"IFERROR(INDEX('Cert Data Sheet'!$A$3:$E$990,SMALL(IF('Cert Data Sheet'!$A$3:$A$990=$E$3,ROW('Cert Data Sheet'!$A$3:$A$990)),ROW(4:4))-2,4),\"\")","v":0},null,{"$f":"IFERROR(IF(G11=\"\",\"\",VLOOKUP(G11,Points!$A$2:$B$6,2,FALSE)),\"\")","v":""},""]
[null,"Mandatory",{"$f":"IFERROR(INDEX('Cert Data Sheet'!$A$3:$E$990,SMALL(IF('Cert Data Sheet'!$A$3:$A$990=$E$3,ROW('Cert Data Sheet'!$A$3:$A$990)),ROW(5:5))-2,5),\"\")","v":0},{"$f":"IFERROR(INDEX('Cert Data Sheet'!$A$3:$E$990,SMALL(IF('Cert Data Sheet'!$A$3:$A$990=$E$3,ROW('Cert Data Sheet'!$A$3:$A$990)),ROW(5:5))-2,2),\"\")","v":0},{"$f":"IFERROR(INDEX('Cert Data Sheet'!$A$3:$E$990,SMALL(IF('Cert Data Sheet'!$A$3:$A$990=$E$3,ROW('Cert Data Sheet'!$A$3:$A$990)),ROW(5:5))-2,3),\"\")","v":0},{"$f":"IFERROR(INDEX('Cert Data Sheet'!$A$3:$E$990,SMALL(IF('Cert Data Sheet'!$A$3:$A$990=$E$3,ROW('Cert Data Sheet'!$A$3:$A$990)),ROW(5:5))-2,4),\"\")","v":0},null,{"$f":"IFERROR(IF(G12=\"\",\"\",VLOOKUP(G12,Points!$A$2:$B$6,2,FALSE)),\"\")","v":""},""]
[null,"Mandatory",{"$f":"IFERROR(INDEX('Cert Data Sheet'!$A$3:$E$990,SMALL(IF('Cert Data Sheet'!$A$3:$A$990=$E$3,ROW('Cert Data Sheet'!$A$3:$A$990)),ROW(6:6))-2,5),\"\")","v":0},{"$f":"IFERROR(INDEX('Cert Data Sheet'!$A$3:$E$990,SMALL(IF('Cert Data Sheet'!$A$3:$A$990=$E$3,ROW('Cert Data Sheet'!$A$3:$A$990)),ROW(6:6))-2,2),\"\")","v":0},{"$f":"IFERROR(INDEX('Cert Data Sheet'!$A$3:$E$990,SMALL(IF('Cert Data Sheet'!$A$3:$A$990=$E$3,ROW('Cert Data Sheet'!$A$3:$A$990)),ROW(6:6))-2,3),\"\")","v":0},{"$f":"IFERROR(INDEX('Cert Data Sheet'!$A$3:$E$990,SMALL(IF('Cert Data Sheet'!$A$3:$A$990=$E$3,ROW('Cert Data Sheet'!$A$3:$A$990)),ROW(6:6))-2,4),\"\")","v":0},null,{"$f":"IFERROR(IF(G13=\"\",\"\",VLOOKUP(G13,Points!$A$2:$B$6,2,FALSE)),\"\")","v":""},""]
[null,"Mandatory",{"$f":"IFERROR(INDEX('Cert Data Sheet'!$A$3:$E$990,SMALL(IF('Cert Data Sheet'!$A$3:$A$990=$E$3,ROW('Cert Data Sheet'!$A$3:$A$990)),ROW(7:7))-2,5),\"\")","v":0},{"$f":"IFERROR(INDEX('Cert Data Sheet'!$A$3:$E$990,SMALL(IF('Cert Data Sheet'!$A$3:$A$990=$E$3,ROW('Cert Data Sheet'!$A$3:$A$990)),ROW(7:7))-2,2),\"\")","v":0},{"$f":"IFERROR(INDEX('Cert Data Sheet'!$A$3:$E$990,SMALL(IF('Cert Data Sheet'!$A$3:$A$990=$E$3,ROW('Cert Data Sheet'!$A$3:$A$990)),ROW(7:7))-2,3),\"\")","v":0},{"$f":"IFERROR(INDEX('Cert Data Sheet'!$A$3:$E$990,SMALL(IF('Cert Data Sheet'!$A$3:$A$990=$E$3,ROW('Cert Data Sheet'!$A$3:$A$990)),ROW(7:7))-2,4),\"\")","v":0},null,{"$f":"IFERROR(IF(G14=\"\",\"\",VLOOKUP(G14,Points!$A$2:$B$6,2,FALSE)),\"\")","v":""},""]
[null,"Mandatory",{"$f":"IFERROR(INDEX('Cert Data Sheet'!$A$3:$E$990,SMALL(IF('Cert Data Sheet'!$A$3:$A$990=$E$3,ROW('Cert Data Sheet'!$A$3:$A$990)),ROW(8:8))-2,5),\"\")","v":0},{"$f":"IFERROR(INDEX('Cert Data Sheet'!$A$3:$E$990,SMALL(IF('Cert Data Sheet'!$A$3:$A$990=$E$3,ROW('Cert Data Sheet'!$A$3:$A$990)),ROW(8:8))-2,2),\"\")","v":0},{"$f":"IFERROR(INDEX('Cert Data Sheet'!$A$3:$E$990,SMALL(IF('Cert Data Sheet'!$A$3:$A$990=$E$3,ROW('Cert Data Sheet'!$A$3:$A$990)),ROW(8:8))-2,3),\"\")","v":0},{"$f":"IFERROR(INDEX('Cert Data Sheet'!$A$3:$E$990,SMALL(IF('Cert Data Sheet'!$A$3:$A$990=$E$3,ROW('Cert Data Sheet'!$A$3:$A$990)),ROW(8:8))-2,4),\"\")","v":0},null,{"$f":"IFERROR(IF(G15=\"\",\"\",VLOOKUP(G15,Points!$A$2:$B$6,2,FALSE)),\"\")","v":""},""]
[null,"Mandatory",{"$f":"IFERROR(INDEX('Cert Data Sheet'!$A$3:$E$990,SMALL(IF('Cert Data Sheet'!$A$3:$A$990=$E$3,ROW('Cert Data Sheet'!$A$3:$A$990)),ROW(9:9))-2,5),\"\")","v":0},{"$f":"IFERROR(INDEX('Cert Data Sheet'!$A$3:$E$990,SMALL(IF('Cert Data Sheet'!$A$3:$A$990=$E$3,ROW('Cert Data Sheet'!$A$3:$A$990)),ROW(9:9))-2,2),\"\")","v":0},{"$f":"IFERROR(INDEX('Cert Data Sheet'!$A$3:$E$990,SMALL(IF('Cert Data Sheet'!$A$3:$A$990=$E$3,ROW('Cert Data Sheet'!$A$3:$A$990)),ROW(9:9))-2,3),\"\")","v":0},{"$f":"IFERROR(INDEX('Cert Data Sheet'!$A$3:$E$990,SMALL(IF('Cert Data Sheet'!$A$3:$A$990=$E$3,ROW('Cert Data Sheet'!$A$3:$A$990)),ROW(9:9))-2,4),\"\")","v":0},null,{"$f":"IFERROR(IF(G16=\"\",\"\",VLOOKUP(G16,Points!$A$2:$B$6,2,FALSE)),\"\")","v":""},""]
[null,"Mandatory",{"$f":"IFERROR(INDEX('Cert Data Sheet'!$A$3:$E$990,SMALL(IF('Cert Data Sheet'!$A$3:$A$990=$E$3,ROW('Cert Data Sheet'!$A$3:$A$990)),ROW(10:10))-2,5),\"\")","v":0},{"$f":"IFERROR(INDEX('Cert Data Sheet'!$A$3:$E$990,SMALL(IF('Cert Data Sheet'!$A$3:$A$990=$E$3,ROW('Cert Data Sheet'!$A$3:$A$990)),ROW(10:10))-2,2),\"\")","v":0},{"$f":"IFERROR(INDEX('Cert Data Sheet'!$A$3:$E$990,SMALL(IF('Cert Data Sheet'!$A$3:$A$990=$E$3,ROW('Cert Data Sheet'!$A$3:$A$990)),ROW(10:10))-2,3),\"\")","v":0},{"$f":"IFERROR(INDEX('Cert Data Sheet'!$A$3:$E$990,SMALL(IF('Cert Data Sheet'!$A$3:$A$990=$E$3,ROW('Cert Data Sheet'!$A$3:$A$990)),ROW(10:10))-2,4),\"\")","v":0},null,{"$f":"IFERROR(IF(G17=\"\",\"\",VLOOKUP(G17,Points!$A$2:$B$6,2,FALSE)),\"\")","v":""},""]
[null,null,null,null,null,{"$f":"SUM(F8:F17)","v":0}]
[null,"Choose up to four optional units to a total of 240 GLH"]
[null,"Optional",{"$f":"IFERROR(INDEX('Cert Data Sheet'!$L$3:$L$990,MATCH(Cert!E20&$E$3,'Cert Data Sheet'!$G$3:$G$990&'Cert Data Sheet'!$H$3:$H$990,0)),\"\")","v":0},{"$f":"IFERROR(INDEX('Cert Data Sheet'!$I$3:$I$990,MATCH(Cert!E20&$E$3,'Cert Data Sheet'!$G$3:$G$990&'Cert Data Sheet'!$H$3:$H$990,0)),\"\")","v":0},null,{"$f":"IFERROR(INDEX('Cert Data Sheet'!$K$3:$K$990,MATCH(Cert!E20&$E$3,'Cert Data Sheet'!$G$3:$G$990&'Cert Data Sheet'!$H$3:$H$990,0)),\"\")","v":0},null,{"$f":"IFERROR(IF(G20=\"\",\"\",VLOOKUP(G20,Points!$A$2:$B$6,2,FALSE)),\"\")","v":""},{"$f":"IFERROR(SUM(H20*(F20/10)),\"\")","v":""}]
[null,"Optional",{"$f":"IFERROR(INDEX('Cert Data Sheet'!$L$3:$L$990,MATCH(Cert!E21&$E$3,'Cert Data Sheet'!$G$3:$G$990&'Cert Data Sheet'!$H$3:$H$990,0)),\"\")","v":0},{"$f":"IFERROR(INDEX('Cert Data Sheet'!$I$3:$I$990,MATCH(Cert!E21&$E$3,'Cert Data Sheet'!$G$3:$G$990&'Cert Data Sheet'!$H$3:$H$990,0)),\"\")","v":0},null,{"$f":"IFERROR(INDEX('Cert Data Sheet'!$K$3:$K$990,MATCH(Cert!E21&$E$3,'Cert Data Sheet'!$G$3:$G$990&'Cert Data Sheet'!$H$3:$H$990,0)),\"\")","v":0},null,{"$f":"IFERROR(IF(G21=\"\",\"\",VLOOKUP(G21,Points!$A$2:$B$6,2,FALSE)),\"\")","v":""},""]
[null,"Optional",{"$f":"IFERROR(INDEX('Cert Data Sheet'!$L$3:$L$990,MATCH(Cert!E22&$E$3,'Cert Data Sheet'!$G$3:$G$990&'Cert Data Sheet'!$H$3:$H$990,0)),\"\")","v":0},{"$f":"IFERROR(INDEX('Cert Data Sheet'!$I$3:$I$990,MATCH(Cert!E22&$E$3,'Cert Data Sheet'!$G$3:$G$990&'Cert Data Sheet'!$H$3:$H$990,0)),\"\")","v":0},null,{"$f":"IFERROR(INDEX('Cert Data Sheet'!$K$3:$K$990,MATCH(Cert!E22&$E$3,'Cert Data Sheet'!$G$3:$G$990&'Cert Data Sheet'!$H$3:$H$990,0)),\"\")","v":0},null,{"$f":"IFERROR(IF(G22=\"\",\"\",VLOOKUP(G22,Points!$A$2:$B$6,2,FALSE)),\"\")","v":""},""]
[null,"Optional",{"$f":"IFERROR(INDEX('Cert Data Sheet'!$L$3:$L$990,MATCH(Cert!E23&$E$3,'Cert Data Sheet'!$G$3:$G$990&'Cert Data Sheet'!$H$3:$H$990,0)),\"\")","v":0},{"$f":"IFERROR(INDEX('Cert Data Sheet'!$I$3:$I$990,MATCH(Cert!E23&$E$3,'Cert Data Sheet'!$G$3:$G$990&'Cert Data Sheet'!$H$3:$H$990,0)),\"\")","v":0},null,{"$f":"IFERROR(INDEX('Cert Data Sheet'!$K$3:$K$990,MATCH(Cert!E23&$E$3,'Cert Data Sheet'!$G$3:$G$990&'Cert Data Sheet'!$H$3:$H$990,0)),\"\")","v":0},null,{"$f":"IFERROR(IF(G23=\"\",\"\",VLOOKUP(G23,Points!$A$2:$B$6,2,FALSE)),\"\")","v":""},""]
[null,"Optional",{"$f":"IFERROR(INDEX('Cert Data Sheet'!$L$3:$L$990,MATCH(Cert!E24&$E$3,'Cert Data Sheet'!$G$3:$G$990&'Cert Data Sheet'!$H$3:$H$990,0)),\"\")","v":0},{"$f":"IFERROR(INDEX('Cert Data Sheet'!$I$3:$I$990,MATCH(Cert!E24&$E$3,'Cert Data Sheet'!$G$3:$G$990&'Cert Data Sheet'!$H$3:$H$990,0)),\"\")","v":0},null,{"$f":"IFERROR(INDEX('Cert Data Sheet'!$K$3:$K$990,MATCH(Cert!E24&$E$3,'Cert Data Sheet'!$G$3:$G$990&'Cert Data Sheet'!$H$3:$H$990,0)),\"\")","v":0},null,{"$f":"IFERROR(IF(G24=\"\",\"\",VLOOKUP(G24,Points!$A$2:$B$6,2,FALSE)),\"\")","v":""},""]
[null,"Optional",{"$f":"IFERROR(INDEX('Cert Data Sheet'!$L$3:$L$990,MATCH(Cert!E25&$E$3,'Cert Data Sheet'!$G$3:$G$990&'Cert Data Sheet'!$H$3:$H$990,0)),\"\")","v":0},{"$f":"IFERROR(INDEX('Cert Data Sheet'!$I$3:$I$990,MATCH(Cert!E25&$E$3,'Cert Data Sheet'!$G$3:$G$990&'Cert Data Sheet'!$H$3:$H$990,0)),\"\")","v":0},null,{"$f":"IFERROR(INDEX('Cert Data Sheet'!$K$3:$K$990,MATCH(Cert!E25&$E$3,'Cert Data Sheet'!$G$3:$G$990&'Cert Data Sheet'!$H$3:$H$990,0)),\"\")","v":0},null,{"$f":"IFERROR(IF(G25=\"\",\"\",VLOOKUP(G25,Points!$A$2:$B$6,2,FALSE)),\"\")","v":""},""]
[null,"Optional",{"$f":"IFERROR(INDEX('Cert Data Sheet'!$L$3:$L$990,MATCH(Cert!E26&$E$3,'Cert Data Sheet'!$G$3:$G$990&'Cert Data Sheet'!$H$3:$H$990,0)),\"\")","v":0},{"$f":"IFERROR(INDEX('Cert Data Sheet'!$I$3:$I$990,MATCH(Cert!E26&$E$3,'Cert Data Sheet'!$G$3:$G$990&'Cert Data Sheet'!$H$3:$H$990,0)),\"\")","v":0},null,{"$f":"IFERROR(INDEX('Cert Data Sheet'!$K$3:$K$990,MATCH(Cert!E26&$E$3,'Cert Data Sheet'!$G$3:$G$990&'Cert Data Sheet'!$H$3:$H$990,0)),\"\")","v":0},null,{"$f":"IFERROR(IF(G26=\"\",\"\",VLOOKUP(G26,Points!$A$2:$B$6,2,FALSE)),\"\")","v":""},""]
[null,"Optional",{"$f":"IFERROR(INDEX('Cert Data Sheet'!$L$3:$L$990,MATCH(Cert!E27&$E$3,'Cert Data Sheet'!$G$3:$G$990&'Cert Data Sheet'!$H$3:$H$990,0)),\"\")","v":0},{"$f":"IFERROR(INDEX('Cert Data Sheet'!$I$3:$I$990,MATCH(Cert!E27&$E$3,'Cert Data Sheet'!$G$3:$G$990&'Cert Data Sheet'!$H$3:$H$990,0)),\"\")","v":0},null,{"$f":"IFERROR(INDEX('Cert Data Sheet'!$K$3:$K$990,MATCH(Cert!E27&$E$3,'Cert Data Sheet'!$G$3:$G$990&'Cert Data Sheet'!$H$3:$H$990,0)),\"\")","v":0},null,{"$f":"IFERROR(IF(G27=\"\",\"\",VLOOKUP(G27,Points!$A$2:$B$6,2,FALSE)),\"\")","v":""},""]
[null,"Optional",{"$f":"IFERROR(INDEX('Cert Data Sheet'!$L$3:$L$990,MATCH(Cert!E28&$E$3,'Cert Data Sheet'!$G$3:$G$990&'Cert Data Sheet'!$H$3:$H$990,0)),\"\")","v":0},{"$f":"IFERROR(INDEX('Cert Data Sheet'!$I$3:$I$990,MATCH(Cert!E28&$E$3,'Cert Data Sheet'!$G$3:$G$990&'Cert Data Sheet'!$H$3:$H$990,0)),\"\")","v":0},null,{"$f":"IFERROR(INDEX('Cert Data Sheet'!$K$3:$K$990,MATCH(Cert!E28&$E$3,'Cert Data Sheet'!$G$3:$G$990&'Cert Data Sheet'!$H$3:$H$990,0)),\"\")","v":0},null,{"$f":"IFERROR(IF(G28=\"\",\"\",VLOOKUP(G28,Points!$A$2:$B$6,2,FALSE)),\"\")","v":""},""]
[null,"Optional",{"$f":"IFERROR(INDEX('Cert Data Sheet'!$L$3:$L$990,MATCH(Cert!E29&$E$3,'Cert Data Sheet'!$G$3:$G$990&'Cert Data Sheet'!$H$3:$H$990,0)),\"\")","v":0},{"$f":"IFERROR(INDEX('Cert Data Sheet'!$I$3:$I$990,MATCH(Cert!E29&$E$3,'Cert Data Sheet'!$G$3:$G$990&'Cert Data Sheet'!$H$3:$H$990,0)),\"\")","v":0},null,{"$f":"IFERROR(INDEX('Cert Data Sheet'!$K$3:$K$990,MATCH(Cert!E29&$E$3,'Cert Data Sheet'!$G$3:$G$990&'Cert Data Sheet'!$H$3:$H$990,0)),\"\")","v":0},null,{"$f":"IFERROR(IF(G29=\"\",\"\",VLOOKUP(G29,Points!$A$2:$B$6,2,FALSE)),\"\")","v":""},""]
[null,null,null,null,null,{"$f":"SUM(F20:F29)","v":0}]
[null,"Choose a maximum of one unit from Group B"]
[null,"Optional",{"$f":"IFERROR(INDEX('Cert Data Sheet'!$S$3:$S$990,MATCH(Cert!E32&$E$3,'Cert Data Sheet'!$N$3:$N$990&'Cert Data Sheet'!$O$3:$O$990,0)),\"\")","v":0},{"$f":"IFERROR(INDEX('Cert Data Sheet'!$P$3:$P$990,MATCH(Cert!E32&$E$3,'Cert Data Sheet'!$N$3:$N$990&'Cert Data Sheet'!$O$3:$O$990,0)),\"\")","v":0},null,{"$f":"IFERROR(INDEX('Cert Data Sheet'!$R$3:$R$990,MATCH(Cert!E32&$E$3,'Cert Data Sheet'!$N$3:$N$990&'Cert Data Sheet'!$O$3:$O$990,0)),\"\")","v":0},null,{"$f":"IFERROR(IF(G32=\"\",\"\",VLOOKUP(G32,Points!$A$2:$B$6,2,FALSE)),\"\")","v":""},{"$f":"IFERROR(SUM(H32*(F32/10)),\"\")","v":""}]
[null,"Optional",{"$f":"IFERROR(INDEX('Cert Data Sheet'!$S$3:$S$990,MATCH(Cert!E33&$E$3,'Cert Data Sheet'!$N$3:$N$990&'Cert Data Sheet'!$O$3:$O$990,0)),\"\")","v":0},{"$f":"IFERROR(INDEX('Cert Data Sheet'!$P$3:$P$990,MATCH(Cert!E33&$E$3,'Cert Data Sheet'!$N$3:$N$990&'Cert Data Sheet'!$O$3:$O$990,0)),\"\")","v":0},null,{"$f":"IFERROR(INDEX('Cert Data Sheet'!$R$3:$R$990,MATCH(Cert!E33&$E$3,'Cert Data Sheet'!$N$3:$N$990&'Cert Data Sheet'!$O$3:$O$990,0)),\"\")","v":0},null,{"$f":"IFERROR(IF(G33=\"\",\"\",VLOOKUP(G33,Points!$A$2:$B$6,2,FALSE)),\"\")","v":""},""]
[null,"Optional",{"$f":"IFERROR(INDEX('Cert Data Sheet'!$S$3:$S$990,MATCH(Cert!E34&$E$3,'Cert Data Sheet'!$N$3:$N$990&'Cert Data Sheet'!$O$3:$O$990,0)),\"\")","v":0},{"$f":"IFERROR(INDEX('Cert Data Sheet'!$P$3:$P$990,MATCH(Cert!E34&$E$3,'Cert Data Sheet'!$N$3:$N$990&'Cert Data Sheet'!$O$3:$O$990,0)),\"\")","v":0},null,{"$f":"IFERROR(INDEX('Cert Data Sheet'!$R$3:$R$990,MATCH(Cert!E34&$E$3,'Cert Data Sheet'!$N$3:$N$990&'Cert Data Sheet'!$O$3:$O$990,0)),\"\")","v":0},null,{"$f":"IFERROR(IF(G34=\"\",\"\",VLOOKUP(G34,Points!$A$2:$B$6,2,FALSE)),\"\")","v":""},""]
[null,"Optional",{"$f":"IFERROR(INDEX('Cert Data Sheet'!$S$3:$S$990,MATCH(Cert!E35&$E$3,'Cert Data Sheet'!$N$3:$N$990&'Cert Data Sheet'!$O$3:$O$990,0)),\"\")","v":0},{"$f":"IFERROR(INDEX('Cert Data Sheet'!$P$3:$P$990,MATCH(Cert!E35&$E$3,'Cert Data Sheet'!$N$3:$N$990&'Cert Data Sheet'!$O$3:$O$990,0)),\"\")","v":0},null,{"$f":"IFERROR(INDEX('Cert Data Sheet'!$R$3:$R$990,MATCH(Cert!E35&$E$3,'Cert Data Sheet'!$N$3:$N$990&'Cert Data Sheet'!$O$3:$O$990,0)),\"\")","v":0},null,{"$f":"IFERROR(IF(G35=\"\",\"\",VLOOKUP(G35,Points!$A$2:$B$6,2,FALSE)),\"\")","v":""},""]
[null,"Optional",{"$f":"IFERROR(INDEX('Cert Data Sheet'!$S$3:$S$990,MATCH(Cert!E36&$E$3,'Cert Data Sheet'!$N$3:$N$990&'Cert Data Sheet'!$O$3:$O$990,0)),\"\")","v":0},{"$f":"IFERROR(INDEX('Cert Data Sheet'!$P$3:$P$990,MATCH(Cert!E36&$E$3,'Cert Data Sheet'!$N$3:$N$990&'Cert Data Sheet'!$O$3:$O$990,0)),\"\")","v":0},null,{"$f":"IFERROR(INDEX('Cert Data Sheet'!$R$3:$R$990,MATCH(Cert!E36&$E$3,'Cert Data Sheet'!$N$3:$N$990&'Cert Data Sheet'!$O$3:$O$990,0)),\"\")","v":0},null,{"$f":"IFERROR(IF(G36=\"\",\"\",VLOOKUP(G36,Points!$A$2:$B$6,2,FALSE)),\"\")","v":""},""]
[null,"Optional",{"$f":"IFERROR(INDEX('Cert Data Sheet'!$S$3:$S$990,MATCH(Cert!E37&$E$3,'Cert Data Sheet'!$N$3:$N$990&'Cert Data Sheet'!$O$3:$O$990,0)),\"\")","v":0},{"$f":"IFERROR(INDEX('Cert Data Sheet'!$P$3:$P$990,MATCH(Cert!E37&$E$3,'Cert Data Sheet'!$N$3:$N$990&'Cert Data Sheet'!$O$3:$O$990,0)),\"\")","v":0},null,{"$f":"IFERROR(INDEX('Cert Data Sheet'!$R$3:$R$990,MATCH(Cert!E37&$E$3,'Cert Data Sheet'!$N$3:$N$990&'Cert Data Sheet'!$O$3:$O$990,0)),\"\")","v":0},null,{"$f":"IFERROR(IF(G37=\"\",\"\",VLOOKUP(G37,Points!$A$2:$B$6,2,FALSE)),\"\")","v":""},""]
[null,"Optional",{"$f":"IFERROR(INDEX('Cert Data Sheet'!$S$3:$S$990,MATCH(Cert!E38&$E$3,'Cert Data Sheet'!$N$3:$N$990&'Cert Data Sheet'!$O$3:$O$990,0)),\"\")","v":0},{"$f":"IFERROR(INDEX('Cert Data Sheet'!$P$3:$P$990,MATCH(Cert!E38&$E$3,'Cert Data Sheet'!$N$3:$N$990&'Cert Data Sheet'!$O$3:$O$990,0)),\"\")","v":0},null,{"$f":"IFERROR(INDEX('Cert Data Sheet'!$R$3:$R$990,MATCH(Cert!E38&$E$3,'Cert Data Sheet'!$N$3:$N$990&'Cert Data Sheet'!$O$3:$O$990,0)),\"\")","v":0},null,{"$f":"IFERROR(IF(G38=\"\",\"\",VLOOKUP(G38,Points!$A$2:$B$6,2,FALSE)),\"\")","v":""},""]
[null,"Optional",{"$f":"IFERROR(INDEX('Cert Data Sheet'!$S$3:$S$990,MATCH(Cert!E39&$E$3,'Cert Data Sheet'!$N$3:$N$990&'Cert Data Sheet'!$O$3:$O$990,0)),\"\")","v":0},{"$f":"IFERROR(INDEX('Cert Data Sheet'!$P$3:$P$990,MATCH(Cert!E39&$E$3,'Cert Data Sheet'!$N$3:$N$990&'Cert Data Sheet'!$O$3:$O$990,0)),\"\")","v":0},null,{"$f":"IFERROR(INDEX('Cert Data Sheet'!$R$3:$R$990,MATCH(Cert!E39&$E$3,'Cert Data Sheet'!$N$3:$N$990&'Cert Data Sheet'!$O$3:$O$990,0)),\"\")","v":0},null,{"$f":"IFERROR(IF(G39=\"\",\"\",VLOOKUP(G39,Points!$A$2:$B$6,2,FALSE)),\"\")","v":""},""]
[null,"Optional",{"$f":"IFERROR(INDEX('Cert Data Sheet'!$S$3:$S$990,MATCH(Cert!E40&$E$3,'Cert Data Sheet'!$N$3:$N$990&'Cert Data Sheet'!$O$3:$O$990,0)),\"\")","v":0},{"$f":"IFERROR(INDEX('Cert Data Sheet'!$P$3:$P$990,MATCH(Cert!E40&$E$3,'Cert Data Sheet'!$N$3:$N$990&'Cert Data Sheet'!$O$3:$O$990,0)),\"\")","v":0},null,{"$f":"IFERROR(INDEX('Cert Data Sheet'!$R$3:$R$990,MATCH(Cert!E40&$E$3,'Cert Data Sheet'!$N$3:$N$990&'Cert Data Sheet'!$O$3:$O$990,0)),\"\")","v":0},null,{"$f":"IFERROR(IF(G40=\"\",\"\",VLOOKUP(G40,Points!$A$2:$B$6,2,FALSE)),\"\")","v":""},""]
[null,"Optional",{"$f":"IFERROR(INDEX('Cert Data Sheet'!$S$3:$S$990,MATCH(Cert!E41&$E$3,'Cert Data Sheet'!$N$3:$N$990&'Cert Data Sheet'!$O$3:$O$990,0)),\"\")","v":0},{"$f":"IFERROR(INDEX('Cert Data Sheet'!$P$3:$P$990,MATCH(Cert!E41&$E$3,'Cert Data Sheet'!$N$3:$N$990&'Cert Data Sheet'!$O$3:$O$990,0)),\"\")","v":0},null,{"$f":"IFERROR(INDEX('Cert Data Sheet'!$R$3:$R$990,MATCH(Cert!E41&$E$3,'Cert Data Sheet'!$N$3:$N$990&'Cert Data Sheet'!$O$3:$O$990,0)),\"\")","v":0},null,{"$f":"IFERROR(IF(G41=\"\",\"\",VLOOKUP(G41,Points!$A$2:$B$6,2,FALSE)),\"\")","v":""},""]
[null,null,null,null,null,{"$f":"SUM(F32:F41)","v":0}]
[null,null,null,null,null,{"$f":"SUM(F18+F30+F42)","v":0},"Overall Grade",null,{"$f":"IFERROR(IF($I$44=\"\",\"\",VLOOKUP($I$44,Points!$H$2:$I$10,2,TRUE)),\"\")","v":"U"}]
[null,null,null,null,null,null,"Points",null,{"$f":"SUM(I8:I41)","v":0}]

{"sheet":"Ext Cert","index":3,"n_rows":44,"n_cols":9,"rows_kept":44,"cut":false,"hidden":false,"merged":[]}
[]
[]
[]
[]
[]
[]
[null,null,"Assessment Type","Unit Number","Unit Name","GLH","Grade",null,"Points"]
[null,"Mandatory",{"$f":"IFERROR(INDEX('Ext Cert Data Sheet'!$A$3:$E$997,SMALL(IF('Ext Cert Data Sheet'!$A$3:$A$997=$E$3,ROW('Ext Cert Data Sheet'!$A$3:$A$997)),ROW(1:1))-2,5),\"\")","v":0},{"$f":"IFERROR(INDEX('Ext Cert Data Sheet'!$A$3:$E$997,SMALL(IF('Ext Cert Data Sheet'!$A$3:$A$997=$E$3,ROW('Ext Cert Data Sheet'!$A$3:$A$997)),ROW(1:1))-2,2),\"\")","v":0},{"$f":"IFERROR(INDEX('Ext Cert Data Sheet'!$A$3:$E$997,SMALL(IF('Ext Cert Data Sheet'!$A$3:$A$997=$E$3,ROW('Ext Cert Data Sheet'!$A$3:$A$997)),ROW(1:1))-2,3),\"\")","v":0},{"$f":"IFERROR(INDEX('Ext Cert Data Sheet'!$A$3:$E$997,SMALL(IF('Ext Cert Data Sheet'!$A$3:$A$997=$E$3,ROW('Ext Cert Data Sheet'!$A$3:$A$997)),ROW(1:1))-2,4),\"\")","v":0},null,{"$f":"IFERROR(IF(G8=\"\",\"\",VLOOKUP(G8,Points!$A$2:$B$6,2,FALSE)),\"\")","v":""},{"$f":"IFERROR(SUM(H8*(F8/10)),\"\")","v":""}]
[null,"Mandatory",{"$f":"IFERROR(INDEX('Ext Cert Data Sheet'!$A$3:$E$997,SMALL(IF('Ext Cert Data Sheet'!$A$3:$A$997=$E$3,ROW('Ext Cert Data Sheet'!$A$3:$A$997)),ROW(2:2))-2,5),\"\")","v":0},{"$f":"IFERROR(INDEX('Ext Cert Data Sheet'!$A$3:$E$997,SMALL(IF('Ext Cert Data Sheet'!$A$3:$A$997=$E$3,ROW('Ext Cert Data Sheet'!$A$3:$A$997)),ROW(2:2))-2,2),\"\")","v":0},{"$f":"IFERROR(INDEX('Ext Cert Data Sheet'!$A$3:$E$997,SMALL(IF('Ext Cert Data Sheet'!$A$3:$A$997=$E$3,ROW('Ext Cert Data Sheet'!$A$3:$A$997)),ROW(2:2))-2,3),\"\")","v":0},{"$f":"IFERROR(INDEX('Ext Cert Data Sheet'!$A$3:$E$997,SMALL(IF('Ext Cert Data Sheet'!$A$3:$A$997=$E$3,ROW('Ext Cert Data Sheet'!$A$3:$A$997)),ROW(2:2))-2,4),\"\")","v":0},null,{"$f":"IFERROR(IF(G9=\"\",\"\",VLOOKUP(G9,Points!$A$2:$B$6,2,FALSE)),\"\")","v":""},{"$f":"IFERROR(SUM(H9*(F9/10)),\"\")","v":""}]
[null,"Mandatory",{"$f":"IFERROR(INDEX('Ext Cert Data Sheet'!$A$3:$E$997,SMALL(IF('Ext Cert Data Sheet'!$A$3:$A$997=$E$3,ROW('Ext Cert Data Sheet'!$A$3:$A$997)),ROW(3:3))-2,5),\"\")","v":0},{"$f":"IFERROR(INDEX('Ext Cert Data Sheet'!$A$3:$E$997,SMALL(IF('Ext Cert Data Sheet'!$A$3:$A$997=$E$3,ROW('Ext Cert Data Sheet'!$A$3:$A$997)),ROW(3:3))-2,2),\"\")","v":0},{"$f":"IFERROR(INDEX('Ext Cert Data Sheet'!$A$3:$E$997,SMALL(IF('Ext Cert Data Sheet'!$A$3:$A$997=$E$3,ROW('Ext Cert Data Sheet'!$A$3:$A$997)),ROW(3:3))-2,3),\"\")","v":0},{"$f":"IFERROR(INDEX('Ext Cert Data Sheet'!$A$3:$E$997,SMALL(IF('Ext Cert Data Sheet'!$A$3:$A$997=$E$3,ROW('Ext Cert Data Sheet'!$A$3:$A$997)),ROW(3:3))-2,4),\"\")","v":0},null,{"$f":"IFERROR(IF(G10=\"\",\"\",VLOOKUP(G10,Points!$A$2:$B$6,2,FALSE)),\"\")","v":""},{"$f":"IFERROR(SUM(H10*(F10/10)),\"\")","v":""}]
[null,"Mandatory",{"$f":"IFERROR(INDEX('Ext Cert Data Sheet'!$A$3:$E$997,SMALL(IF('Ext Cert Data Sheet'!$A$3:$A$997=$E$3,ROW('Ext Cert Data Sheet'!$A$3:$A$997)),ROW(4:4))-2,5),\"\")","v":0},{"$f":"IFERROR(INDEX('Ext Cert Data Sheet'!$A$3:$E$997,SMALL(IF('Ext Cert Data Sheet'!$A$3:$A$997=$E$3,ROW('Ext Cert Data Sheet'!$A$3:$A$997)),ROW(4:4))-2,2),\"\")","v":0},{"$f":"IFERROR(INDEX('Ext Cert Data Sheet'!$A$3:$E$997,SMALL(IF('Ext Cert Data Sheet'!$A$3:$A$997=$E$3,ROW('Ext Cert Data Sheet'!$A$3:$A$997)),ROW(4:4))-2,3),\"\")","v":0},{"$f":"IFERROR(INDEX('Ext Cert Data Sheet'!$A$3:$E$997,SMALL(IF('Ext Cert Data Sheet'!$A$3:$A$997=$E$3,ROW('Ext Cert Data Sheet'!$A$3:$A$997)),ROW(4:4))-2,4),\"\")","v":0},null,{"$f":"IFERROR(IF(G11=\"\",\"\",VLOOKUP(G11,Points!$A$2:$B$6,2,FALSE)),\"\")","v":""},""]
[null,"Mandatory",{"$f":"IFERROR(INDEX('Ext Cert Data Sheet'!$A$3:$E$997,SMALL(IF('Ext Cert Data Sheet'!$A$3:$A$997=$E$3,ROW('Ext Cert Data Sheet'!$A$3:$A$997)),ROW(5:5))-2,5),\"\")","v":0},{"$f":"IFERROR(INDEX('Ext Cert Data Sheet'!$A$3:$E$997,SMALL(IF('Ext Cert Data Sheet'!$A$3:$A$997=$E$3,ROW('Ext Cert Data Sheet'!$A$3:$A$997)),ROW(5:5))-2,2),\"\")","v":0},{"$f":"IFERROR(INDEX('Ext Cert Data Sheet'!$A$3:$E$997,SMALL(IF('Ext Cert Data Sheet'!$A$3:$A$997=$E$3,ROW('Ext Cert Data Sheet'!$A$3:$A$997)),ROW(5:5))-2,3),\"\")","v":0},{"$f":"IFERROR(INDEX('Ext Cert Data Sheet'!$A$3:$E$997,SMALL(IF('Ext Cert Data Sheet'!$A$3:$A$997=$E$3,ROW('Ext Cert Data Sheet'!$A$3:$A$997)),ROW(5:5))-2,4),\"\")","v":0},null,{"$f":"IFERROR(IF(G12=\"\",\"\",VLOOKUP(G12,Points!$A$2:$B$6,2,FALSE)),\"\")","v":""},""]
[null,"Mandatory",{"$f":"IFERROR(INDEX('Ext Cert Data Sheet'!$A$3:$E$997,SMALL(IF('Ext Cert Data Sheet'!$A$3:$A$997=$E$3,ROW('Ext Cert Data Sheet'!$A$3:$A$997)),ROW(6:6))-2,5),\"\")","v":0},{"$f":"IFERROR(INDEX('Ext Cert Data Sheet'!$A$3:$E$997,SMALL(IF('Ext Cert Data Sheet'!$A$3:$A$997=$E$3,ROW('Ext Cert Data Sheet'!$A$3:$A$997)),ROW(6:6))-2,2),\"\")","v":0},{"$f":"IFERROR(INDEX('Ext Cert Data Sheet'!$A$3:$E$997,SMALL(IF('Ext Cert Data Sheet'!$A$3:$A$997=$E$3,ROW('Ext Cert Data Sheet'!$A$3:$A$997)),ROW(6:6))-2,3),\"\")","v":0},{"$f":"IFERROR(INDEX('Ext Cert Data Sheet'!$A$3:$E$997,SMALL(IF('Ext Cert Data Sheet'!$A$3:$A$997=$E$3,ROW('Ext Cert Data Sheet'!$A$3:$A$997)),ROW(6:6))-2,4),\"\")","v":0},null,{"$f":"IFERROR(IF(G13=\"\",\"\",VLOOKUP(G13,Points!$A$2:$B$6,2,FALSE)),\"\")","v":""},""]
[null,"Mandatory",{"$f":"IFERROR(INDEX('Ext Cert Data Sheet'!$A$3:$E$997,SMALL(IF('Ext Cert Data Sheet'!$A$3:$A$997=$E$3,ROW('Ext Cert Data Sheet'!$A$3:$A$997)),ROW(7:7))-2,5),\"\")","v":0},{"$f":"IFERROR(INDEX('Ext Cert Data Sheet'!$A$3:$E$997,SMALL(IF('Ext Cert Data Sheet'!$A$3:$A$997=$E$3,ROW('Ext Cert Data Sheet'!$A$3:$A$997)),ROW(7:7))-2,2),\"\")","v":0},{"$f":"IFERROR(INDEX('Ext Cert Data Sheet'!$A$3:$E$997,SMALL(IF('Ext Cert Data Sheet'!$A$3:$A$997=$E$3,ROW('Ext Cert Data Sheet'!$A$3:$A$997)),ROW(7:7))-2,3),\"\")","v":0},{"$f":"IFERROR(INDEX('Ext Cert Data Sheet'!$A$3:$E$997,SMALL(IF('Ext Cert Data Sheet'!$A$3:$A$997=$E$3,ROW('Ext Cert Data Sheet'!$A$3:$A$997)),ROW(7:7))-2,4),\"\")","v":0},null,{"$f":"IFERROR(IF(G14=\"\",\"\",VLOOKUP(G14,Points!$A$2:$B$6,2,FALSE)),\"\")","v":""},""]
[null,"Mandatory",{"$f":"IFERROR(INDEX('Ext Cert Data Sheet'!$A$3:$E$997,SMALL(IF('Ext Cert Data Sheet'!$A$3:$A$997=$E$3,ROW('Ext Cert Data Sheet'!$A$3:$A$997)),ROW(8:8))-2,5),\"\")","v":0},{"$f":"IFERROR(INDEX('Ext Cert Data Sheet'!$A$3:$E$997,SMALL(IF('Ext Cert Data Sheet'!$A$3:$A$997=$E$3,ROW('Ext Cert Data Sheet'!$A$3:$A$997)),ROW(8:8))-2,2),\"\")","v":0},{"$f":"IFERROR(INDEX('Ext Cert Data Sheet'!$A$3:$E$997,SMALL(IF('Ext Cert Data Sheet'!$A$3:$A$997=$E$3,ROW('Ext Cert Data Sheet'!$A$3:$A$997)),ROW(8:8))-2,3),\"\")","v":0},{"$f":"IFERROR(INDEX('Ext Cert Data Sheet'!$A$3:$E$997,SMALL(IF('Ext Cert Data Sheet'!$A$3:$A$997=$E$3,ROW('Ext Cert Data Sheet'!$A$3:$A$997)),ROW(8:8))-2,4),\"\")","v":0},null,{"$f":"IFERROR(IF(G15=\"\",\"\",VLOOKUP(G15,Points!$A$2:$B$6,2,FALSE)),\"\")","v":""},""]
[null,"Mandatory",{"$f":"IFERROR(INDEX('Ext Cert Data Sheet'!$A$3:$E$997,SMALL(IF('Ext Cert Data Sheet'!$A$3:$A$997=$E$3,ROW('Ext Cert Data Sheet'!$A$3:$A$997)),ROW(9:9))-2,5),\"\")","v":0},{"$f":"IFERROR(INDEX('Ext Cert Data Sheet'!$A$3:$E$997,SMALL(IF('Ext Cert Data Sheet'!$A$3:$A$997=$E$3,ROW('Ext Cert Data Sheet'!$A$3:$A$997)),ROW(9:9))-2,2),\"\")","v":0},{"$f":"IFERROR(INDEX('Ext Cert Data Sheet'!$A$3:$E$997,SMALL(IF('Ext Cert Data Sheet'!$A$3:$A$997=$E$3,ROW('Ext Cert Data Sheet'!$A$3:$A$997)),ROW(9:9))-2,3),\"\")","v":0},{"$f":"IFERROR(INDEX('Ext Cert Data Sheet'!$A$3:$E$997,SMALL(IF('Ext Cert Data Sheet'!$A$3:$A$997=$E$3,ROW('Ext Cert Data Sheet'!$A$3:$A$997)),ROW(9:9))-2,4),\"\")","v":0},null,{"$f":"IFERROR(IF(G16=\"\",\"\",VLOOKUP(G16,Points!$A$2:$B$6,2,FALSE)),\"\")","v":""},""]
[null,"Mandatory",{"$f":"IFERROR(INDEX('Ext Cert Data Sheet'!$A$3:$E$997,SMALL(IF('Ext Cert Data Sheet'!$A$3:$A$997=$E$3,ROW('Ext Cert Data Sheet'!$A$3:$A$997)),ROW(10:10))-2,5),\"\")","v":0},{"$f":"IFERROR(INDEX('Ext Cert Data Sheet'!$A$3:$E$997,SMALL(IF('Ext Cert Data Sheet'!$A$3:$A$997=$E$3,ROW('Ext Cert Data Sheet'!$A$3:$A$997)),ROW(10:10))-2,2),\"\")","v":0},{"$f":"IFERROR(INDEX('Ext Cert Data Sheet'!$A$3:$E$997,SMALL(IF('Ext Cert Data Sheet'!$A$3:$A$997=$E$3,ROW('Ext Cert Data Sheet'!$A$3:$A$997)),ROW(10:10))-2,3),\"\")","v":0},{"$f":"IFERROR(INDEX('Ext Cert Data Sheet'!$A$3:$E$997,SMALL(IF('Ext Cert Data Sheet'!$A$3:$A$997=$E$3,ROW('Ext Cert Data Sheet'!$A$3:$A$997)),ROW(10:10))-2,4),\"\")","v":0},null,{"$f":"IFERROR(IF(G17=\"\",\"\",VLOOKUP(G17,Points!$A$2:$B$6,2,FALSE)),\"\")","v":""},""]
[null,null,null,null,null,{"$f":"SUM(F8:F17)","v":0}]
[null,"Choose two units from Group A"]
[null,"Optional",{"$f":"IFERROR(INDEX('Ext Cert Data Sheet'!$L$3:$L$997,MATCH('Ext Cert'!E20&$E$3,'Ext Cert Data Sheet'!$G$3:$G$997&'Ext Cert Data Sheet'!$H$3:$H$997,0)),\"\")","v":0},{"$f":"IFERROR(INDEX('Ext Cert Data Sheet'!$I$3:$I$997,MATCH('Ext Cert'!E20&$E$3,'Ext Cert Data Sheet'!$G$3:$G$997&'Ext Cert Data Sheet'!$H$3:$H$997,0)),\"\")","v":0},null,{"$f":"IFERROR(INDEX('Ext Cert Data Sheet'!$K$3:$K$997,MATCH('Ext Cert'!E20&$E$3,'Ext Cert Data Sheet'!$G$3:$G$997&'Ext Cert Data Sheet'!$H$3:$H$997,0)),\"\")","v":0},null,{"$f":"IFERROR(IF(G20=\"\",\"\",VLOOKUP(G20,Points!$A$2:$B$6,2,FALSE)),\"\")","v":""},{"$f":"IFERROR(SUM(H20*(F20/10)),\"\")","v":""}]
[null,"Optional",{"$f":"IFERROR(INDEX('Ext Cert Data Sheet'!$L$3:$L$997,MATCH('Ext Cert'!E21&$E$3,'Ext Cert Data Sheet'!$G$3:$G$997&'Ext Cert Data Sheet'!$H$3:$H$997,0)),\"\")","v":0},{"$f":"IFERROR(INDEX('Ext Cert Data Sheet'!$I$3:$I$997,MATCH('Ext Cert'!E21&$E$3,'Ext Cert Data Sheet'!$G$3:$G$997&'Ext Cert Data Sheet'!$H$3:$H$997,0)),\"\")","v":0},null,{"$f":"IFERROR(INDEX('Ext Cert Data Sheet'!$K$3:$K$997,MATCH('Ext Cert'!E21&$E$3,'Ext Cert Data Sheet'!$G$3:$G$997&'Ext Cert Data Sheet'!$H$3:$H$997,0)),\"\")","v":0},null,{"$f":"IFERROR(IF(G21=\"\",\"\",VLOOKUP(G21,Points!$A$2:$B$6,2,FALSE)),\"\")","v":""},""]
[null,"Optional",{"$f":"IFERROR(INDEX('Ext Cert Data Sheet'!$L$3:$L$997,MATCH('Ext Cert'!E22&$E$3,'Ext Cert Data Sheet'!$G$3:$G$997&'Ext Cert Data Sheet'!$H$3:$H$997,0)),\"\")","v":0},{"$f":"IFERROR(INDEX('Ext Cert Data Sheet'!$I$3:$I$997,MATCH('Ext Cert'!E22&$E$3,'Ext Cert Data Sheet'!$G$3:$G$997&'Ext Cert Data Sheet'!$H$3:$H$997,0)),\"\")","v":0},null,{"$f":"IFERROR(INDEX('Ext Cert Data Sheet'!$K$3:$K$997,MATCH('Ext Cert'!E22&$E$3,'Ext Cert Data Sheet'!$G$3:$G$997&'Ext Cert Data Sheet'!$H$3:$H$997,0)),\"\")","v":0},null,{"$f":"IFERROR(IF(G22=\"\",\"\",VLOOKUP(G22,Points!$A$2:$B$6,2,FALSE)),\"\")","v":""},""]
[null,"Optional",{"$f":"IFERROR(INDEX('Ext Cert Data Sheet'!$L$3:$L$997,MATCH('Ext Cert'!E23&$E$3,'Ext Cert Data Sheet'!$G$3:$G$997&'Ext Cert Data Sheet'!$H$3:$H$997,0)),\"\")","v":0},{"$f":"IFERROR(INDEX('Ext Cert Data Sheet'!$I$3:$I$997,MATCH('Ext Cert'!E23&$E$3,'Ext Cert Data Sheet'!$G$3:$G$997&'Ext Cert Data Sheet'!$H$3:$H$997,0)),\"\")","v":0},null,{"$f":"IFERROR(INDEX('Ext Cert Data Sheet'!$K$3:$K$997,MATCH('Ext Cert'!E23&$E$3,'Ext Cert Data Sheet'!$G$3:$G$997&'Ext Cert Data Sheet'!$H$3:$H$997,0)),\"\")","v":0},null,{"$f":"IFERROR(IF(G23=\"\",\"\",VLOOKUP(G23,Points!$A$2:$B$6,2,FALSE)),\"\")","v":""},""]
[null,"Optional",{"$f":"IFERROR(INDEX('Ext Cert Data Sheet'!$L$3:$L$997,MATCH('Ext Cert'!E24&$E$3,'Ext Cert Data Sheet'!$G$3:$G$997&'Ext Cert Data Sheet'!$H$3:$H$997,0)),\"\")","v":0},{"$f":"IFERROR(INDEX('Ext Cert Data Sheet'!$I$3:$I$997,MATCH('Ext Cert'!E24&$E$3,'Ext Cert Data Sheet'!$G$3:$G$997&'Ext Cert Data Sheet'!$H$3:$H$997,0)),\"\")","v":0},null,{"$f":"IFERROR(INDEX('Ext Cert Data Sheet'!$K$3:$K$997,MATCH('Ext Cert'!E24&$E$3,'Ext Cert Data Sheet'!$G$3:$G$997&'Ext Cert Data Sheet'!$H$3:$H$997,0)),\"\")","v":0},null,{"$f":"IFERROR(IF(G24=\"\",\"\",VLOOKUP(G24,Points!$A$2:$B$6,2,FALSE)),\"\")","v":""},""]
[null,"Optional",{"$f":"IFERROR(INDEX('Ext Cert Data Sheet'!$L$3:$L$997,MATCH('Ext Cert'!E25&$E$3,'Ext Cert Data Sheet'!$G$3:$G$997&'Ext Cert Data Sheet'!$H$3:$H$997,0)),\"\")","v":0},{"$f":"IFERROR(INDEX('Ext Cert Data Sheet'!$I$3:$I$997,MATCH('Ext Cert'!E25&$E$3,'Ext Cert Data Sheet'!$G$3:$G$997&'Ext Cert Data Sheet'!$H$3:$H$997,0)),\"\")","v":0},null,{"$f":"IFERROR(INDEX('Ext Cert Data Sheet'!$K$3:$K$997,MATCH('Ext Cert'!E25&$E$3,'Ext Cert Data Sheet'!$G$3:$G$997&'Ext Cert Data Sheet'!$H$3:$H$997,0)),\"\")","v":0},null,{"$f":"IFERROR(IF(G25=\"\",\"\",VLOOKUP(G25,Points!$A$2:$B$6,2,FALSE)),\"\")","v":""},""]
[null,"Optional",{"$f":"IFERROR(INDEX('Ext Cert Data Sheet'!$L$3:$L$997,MATCH('Ext Cert'!E26&$E$3,'Ext Cert Data Sheet'!$G$3:$G$997&'Ext Cert Data Sheet'!$H$3:$H$997,0)),\"\")","v":0},{"$f":"IFERROR(INDEX('Ext Cert Data Sheet'!$I$3:$I$997,MATCH('Ext Cert'!E26&$E$3,'Ext Cert Data Sheet'!$G$3:$G$997&'Ext Cert Data Sheet'!$H$3:$H$997,0)),\"\")","v":0},null,{"$f":"IFERROR(INDEX('Ext Cert Data Sheet'!$K$3:$K$997,MATCH('Ext Cert'!E26&$E$3,'Ext Cert Data Sheet'!$G$3:$G$997&'Ext Cert Data Sheet'!$H$3:$H$997,0)),\"\")","v":0},null,{"$f":"IFERROR(IF(G26=\"\",\"\",VLOOKUP(G26,Points!$A$2:$B$6,2,FALSE)),\"\")","v":""},""]
[null,"Optional",{"$f":"IFERROR(INDEX('Ext Cert Data Sheet'!$L$3:$L$997,MATCH('Ext Cert'!E27&$E$3,'Ext Cert Data Sheet'!$G$3:$G$997&'Ext Cert Data Sheet'!$H$3:$H$997,0)),\"\")","v":0},{"$f":"IFERROR(INDEX('Ext Cert Data Sheet'!$I$3:$I$997,MATCH('Ext Cert'!E27&$E$3,'Ext Cert Data Sheet'!$G$3:$G$997&'Ext Cert Data Sheet'!$H$3:$H$997,0)),\"\")","v":0},null,{"$f":"IFERROR(INDEX('Ext Cert Data Sheet'!$K$3:$K$997,MATCH('Ext Cert'!E27&$E$3,'Ext Cert Data Sheet'!$G$3:$G$997&'Ext Cert Data Sheet'!$H$3:$H$997,0)),\"\")","v":0},null,{"$f":"IFERROR(IF(G27=\"\",\"\",VLOOKUP(G27,Points!$A$2:$B$6,2,FALSE)),\"\")","v":""},""]
[null,"Optional",{"$f":"IFERROR(INDEX('Ext Cert Data Sheet'!$L$3:$L$997,MATCH('Ext Cert'!E28&$E$3,'Ext Cert Data Sheet'!$G$3:$G$997&'Ext Cert Data Sheet'!$H$3:$H$997,0)),\"\")","v":0},{"$f":"IFERROR(INDEX('Ext Cert Data Sheet'!$I$3:$I$997,MATCH('Ext Cert'!E28&$E$3,'Ext Cert Data Sheet'!$G$3:$G$997&'Ext Cert Data Sheet'!$H$3:$H$997,0)),\"\")","v":0},null,{"$f":"IFERROR(INDEX('Ext Cert Data Sheet'!$K$3:$K$997,MATCH('Ext Cert'!E28&$E$3,'Ext Cert Data Sheet'!$G$3:$G$997&'Ext Cert Data Sheet'!$H$3:$H$997,0)),\"\")","v":0},null,{"$f":"IFERROR(IF(G28=\"\",\"\",VLOOKUP(G28,Points!$A$2:$B$6,2,FALSE)),\"\")","v":""},""]
[null,"Optional",{"$f":"IFERROR(INDEX('Ext Cert Data Sheet'!$L$3:$L$997,MATCH('Ext Cert'!E29&$E$3,'Ext Cert Data Sheet'!$G$3:$G$997&'Ext Cert Data Sheet'!$H$3:$H$997,0)),\"\")","v":0},{"$f":"IFERROR(INDEX('Ext Cert Data Sheet'!$I$3:$I$997,MATCH('Ext Cert'!E29&$E$3,'Ext Cert Data Sheet'!$G$3:$G$997&'Ext Cert Data Sheet'!$H$3:$H$997,0)),\"\")","v":0},null,{"$f":"IFERROR(INDEX('Ext Cert Data Sheet'!$K$3:$K$997,MATCH('Ext Cert'!E29&$E$3,'Ext Cert Data Sheet'!$G$3:$G$997&'Ext Cert Data Sheet'!$H$3:$H$997,0)),\"\")","v":0},null,{"$f":"IFERROR(IF(G29=\"\",\"\",VLOOKUP(G29,Points!$A$2:$B$6,2,FALSE)),\"\")","v":""},""]
[null,null,null,null,null,{"$f":"SUM(F20:F29)","v":0}]
[null,"Choose five units from Group B"]
[null,"Optional",{"$f":"IFERROR(INDEX('Ext Cert Data Sheet'!$S$3:$S$997,MATCH('Ext Cert'!E32&$E$3,'Ext Cert Data Sheet'!$N$3:$N$997&'Ext Cert Data Sheet'!$O$3:$O$997,0)),\"\")","v":0},{"$f":"IFERROR(INDEX('Ext Cert Data Sheet'!$P$3:$P$997,MATCH('Ext Cert'!E32&$E$3,'Ext Cert Data Sheet'!$N$3:$N$997&'Ext Cert Data Sheet'!$O$3:$O$997,0)),\"\")","v":0},null,{"$f":"IFERROR(INDEX('Ext Cert Data Sheet'!$R$3:$R$997,MATCH('Ext Cert'!E32&$E$3,'Ext Cert Data Sheet'!$N$3:$N$997&'Ext Cert Data Sheet'!$O$3:$O$997,0)),\"\")","v":0},null,{"$f":"IFERROR(IF(G32=\"\",\"\",VLOOKUP(G32,Points!$A$2:$B$6,2,FALSE)),\"\")","v":""},{"$f":"IFERROR(SUM(H32*(F32/10)),\"\")","v":""}]
[null,"Optional",{"$f":"IFERROR(INDEX('Ext Cert Data Sheet'!$S$3:$S$997,MATCH('Ext Cert'!E33&$E$3,'Ext Cert Data Sheet'!$N$3:$N$997&'Ext Cert Data Sheet'!$O$3:$O$997,0)),\"\")","v":0},{"$f":"IFERROR(INDEX('Ext Cert Data Sheet'!$P$3:$P$997,MATCH('Ext Cert'!E33&$E$3,'Ext Cert Data Sheet'!$N$3:$N$997&'Ext Cert Data Sheet'!$O$3:$O$997,0)),\"\")","v":0},null,{"$f":"IFERROR(INDEX('Ext Cert Data Sheet'!$R$3:$R$997,MATCH('Ext Cert'!E33&$E$3,'Ext Cert Data Sheet'!$N$3:$N$997&'Ext Cert Data Sheet'!$O$3:$O$997,0)),\"\")","v":0},null,{"$f":"IFERROR(IF(G33=\"\",\"\",VLOOKUP(G33,Points!$A$2:$B$6,2,FALSE)),\"\")","v":""},""]
[null,"Optional",{"$f":"IFERROR(INDEX('Ext Cert Data Sheet'!$S$3:$S$997,MATCH('Ext Cert'!E34&$E$3,'Ext Cert Data Sheet'!$N$3:$N$997&'Ext Cert Data Sheet'!$O$3:$O$997,0)),\"\")","v":0},{"$f":"IFERROR(INDEX('Ext Cert Data Sheet'!$P$3:$P$997,MATCH('Ext Cert'!E34&$E$3,'Ext Cert Data Sheet'!$N$3:$N$997&'Ext Cert Data Sheet'!$O$3:$O$997,0)),\"\")","v":0},null,{"$f":"IFERROR(INDEX('Ext Cert Data Sheet'!$R$3:$R$997,MATCH('Ext Cert'!E34&$E$3,'Ext Cert Data Sheet'!$N$3:$N$997&'Ext Cert Data Sheet'!$O$3:$O$997,0)),\"\")","v":0},null,{"$f":"IFERROR(IF(G34=\"\",\"\",VLOOKUP(G34,Points!$A$2:$B$6,2,FALSE)),\"\")","v":""},""]
[null,"Optional",{"$f":"IFERROR(INDEX('Ext Cert Data Sheet'!$S$3:$S$997,MATCH('Ext Cert'!E35&$E$3,'Ext Cert Data Sheet'!$N$3:$N$997&'Ext Cert Data Sheet'!$O$3:$O$997,0)),\"\")","v":0},{"$f":"IFERROR(INDEX('Ext Cert Data Sheet'!$P$3:$P$997,MATCH('Ext Cert'!E35&$E$3,'Ext Cert Data Sheet'!$N$3:$N$997&'Ext Cert Data Sheet'!$O$3:$O$997,0)),\"\")","v":0},null,{"$f":"IFERROR(INDEX('Ext Cert Data Sheet'!$R$3:$R$997,MATCH('Ext Cert'!E35&$E$3,'Ext Cert Data Sheet'!$N$3:$N$997&'Ext Cert Data Sheet'!$O$3:$O$997,0)),\"\")","v":0},null,{"$f":"IFERROR(IF(G35=\"\",\"\",VLOOKUP(G35,Points!$A$2:$B$6,2,FALSE)),\"\")","v":""},""]
[null,"Optional",{"$f":"IFERROR(INDEX('Ext Cert Data Sheet'!$S$3:$S$997,MATCH('Ext Cert'!E36&$E$3,'Ext Cert Data Sheet'!$N$3:$N$997&'Ext Cert Data Sheet'!$O$3:$O$997,0)),\"\")","v":0},{"$f":"IFERROR(INDEX('Ext Cert Data Sheet'!$P$3:$P$997,MATCH('Ext Cert'!E36&$E$3,'Ext Cert Data Sheet'!$N$3:$N$997&'Ext Cert Data Sheet'!$O$3:$O$997,0)),\"\")","v":0},null,{"$f":"IFERROR(INDEX('Ext Cert Data Sheet'!$R$3:$R$997,MATCH('Ext Cert'!E36&$E$3,'Ext Cert Data Sheet'!$N$3:$N$997&'Ext Cert Data Sheet'!$O$3:$O$997,0)),\"\")","v":0},null,{"$f":"IFERROR(IF(G36=\"\",\"\",VLOOKUP(G36,Points!$A$2:$B$6,2,FALSE)),\"\")","v":""},""]
[null,"Optional",{"$f":"IFERROR(INDEX('Ext Cert Data Sheet'!$S$3:$S$997,MATCH('Ext Cert'!E37&$E$3,'Ext Cert Data Sheet'!$N$3:$N$997&'Ext Cert Data Sheet'!$O$3:$O$997,0)),\"\")","v":0},{"$f":"IFERROR(INDEX('Ext Cert Data Sheet'!$P$3:$P$997,MATCH('Ext Cert'!E37&$E$3,'Ext Cert Data Sheet'!$N$3:$N$997&'Ext Cert Data Sheet'!$O$3:$O$997,0)),\"\")","v":0},null,{"$f":"IFERROR(INDEX('Ext Cert Data Sheet'!$R$3:$R$997,MATCH('Ext Cert'!E37&$E$3,'Ext Cert Data Sheet'!$N$3:$N$997&'Ext Cert Data Sheet'!$O$3:$O$997,0)),\"\")","v":0},null,{"$f":"IFERROR(IF(G37=\"\",\"\",VLOOKUP(G37,Points!$A$2:$B$6,2,FALSE)),\"\")","v":""},""]
[null,"Optional",{"$f":"IFERROR(INDEX('Ext Cert Data Sheet'!$S$3:$S$997,MATCH('Ext Cert'!E38&$E$3,'Ext Cert Data Sheet'!$N$3:$N$997&'Ext Cert Data Sheet'!$O$3:$O$997,0)),\"\")","v":0},{"$f":"IFERROR(INDEX('Ext Cert Data Sheet'!$P$3:$P$997,MATCH('Ext Cert'!E38&$E$3,'Ext Cert Data Sheet'!$N$3:$N$997&'Ext Cert Data Sheet'!$O$3:$O$997,0)),\"\")","v":0},null,{"$f":"IFERROR(INDEX('Ext Cert Data Sheet'!$R$3:$R$997,MATCH('Ext Cert'!E38&$E$3,'Ext Cert Data Sheet'!$N$3:$N$997&'Ext Cert Data Sheet'!$O$3:$O$997,0)),\"\")","v":0},null,{"$f":"IFERROR(IF(G38=\"\",\"\",VLOOKUP(G38,Points!$A$2:$B$6,2,FALSE)),\"\")","v":""},""]
[null,"Optional",{"$f":"IFERROR(INDEX('Ext Cert Data Sheet'!$S$3:$S$997,MATCH('Ext Cert'!E39&$E$3,'Ext Cert Data Sheet'!$N$3:$N$997&'Ext Cert Data Sheet'!$O$3:$O$997,0)),\"\")","v":0},{"$f":"IFERROR(INDEX('Ext Cert Data Sheet'!$P$3:$P$997,MATCH('Ext Cert'!E39&$E$3,'Ext Cert Data Sheet'!$N$3:$N$997&'Ext Cert Data Sheet'!$O$3:$O$997,0)),\"\")","v":0},null,{"$f":"IFERROR(INDEX('Ext Cert Data Sheet'!$R$3:$R$997,MATCH('Ext Cert'!E39&$E$3,'Ext Cert Data Sheet'!$N$3:$N$997&'Ext Cert Data Sheet'!$O$3:$O$997,0)),\"\")","v":0},null,{"$f":"IFERROR(IF(G39=\"\",\"\",VLOOKUP(G39,Points!$A$2:$B$6,2,FALSE)),\"\")","v":""},""]
[null,"Optional",{"$f":"IFERROR(INDEX('Ext Cert Data Sheet'!$S$3:$S$997,MATCH('Ext Cert'!E40&$E$3,'Ext Cert Data Sheet'!$N$3:$N$997&'Ext Cert Data Sheet'!$O$3:$O$997,0)),\"\")","v":0},{"$f":"IFERROR(INDEX('Ext Cert Data Sheet'!$P$3:$P$997,MATCH('Ext Cert'!E40&$E$3,'Ext Cert Data Sheet'!$N$3:$N$997&'Ext Cert Data Sheet'!$O$3:$O$997,0)),\"\")","v":0},null,{"$f":"IFERROR(INDEX('Ext Cert Data Sheet'!$R$3:$R$997,MATCH('Ext Cert'!E40&$E$3,'Ext Cert Data Sheet'!$N$3:$N$997&'Ext Cert Data Sheet'!$O$3:$O$997,0)),\"\")","v":0},null,{"$f":"IFERROR(IF(G40=\"\",\"\",VLOOKUP(G40,Points!$A$2:$B$6,2,FALSE)),\"\")","v":""},""]
[null,"Optional",{"$f":"IFERROR(INDEX('Ext Cert Data Sheet'!$S$3:$S$997,MATCH('Ext Cert'!E41&$E$3,'Ext Cert Data Sheet'!$N$3:$N$997&'Ext Cert Data Sheet'!$O$3:$O$997,0)),\"\")","v":0},{"$f":"IFERROR(INDEX('Ext Cert Data Sheet'!$P$3:$P$997,MATCH('Ext Cert'!E41&$E$3,'Ext Cert Data Sheet'!$N$3:$N$997&'Ext Cert Data Sheet'!$O$3:$O$997,0)),\"\")","v":0},null,{"$f":"IFERROR(INDEX('Ext Cert Data Sheet'!$R$3:$R$997,MATCH('Ext Cert'!E41&$E$3,'Ext Cert Data Sheet'!$N$3:$N$997&'Ext Cert Data Sheet'!$O$3:$O$997,0)),\"\")","v":0},null,{"$f":"IFERROR(IF(G41=\"\",\"\",VLOOKUP(G41,Points!$A$2:$B$6,2,FALSE)),\"\")","v":""},""]
[null,null,null,null,null,{"$f":"SUM(F32:F41)","v":0}]
[null,null,null,null,null,{"$f":"SUM(F18+F30+F42)","v":0},"Overall Grade",null,{"$f":"IFERROR(IF($I$44=\"\",\"\",VLOOKUP($I$44,Points!$K$2:$L$10,2,TRUE)),\"\")","v":"U"}]
[null,null,null,null,null,null,"Points",null,{"$f":"SUM(I8:I41)","v":0}]

{"sheet":"Diploma","index":4,"n_rows":44,"n_cols":9,"rows_kept":44,"cut":false,"hidden":false,"merged":[]}
[]
[]
[]
[]
[]
[]
[null,null,"Assessment Type","Unit Number","Unit Name","GLH","Grade",null,"Points"]
[null,"Mandatory",{"$f":"IFERROR(INDEX('Diploma Data Sheet'!$A$3:$E$998,SMALL(IF('Diploma Data Sheet'!$A$3:$A$998=$E$3,ROW('Diploma Data Sheet'!$A$3:$A$998)),ROW(1:1))-2,5),\"\")","v":0},{"$f":"IFERROR(INDEX('Diploma Data Sheet'!$A$3:$E$998,SMALL(IF('Diploma Data Sheet'!$A$3:$A$998=$E$3,ROW('Diploma Data Sheet'!$A$3:$A$998)),ROW(1:1))-2,2),\"\")","v":0},{"$f":"IFERROR(INDEX('Diploma Data Sheet'!$A$3:$E$998,SMALL(IF('Diploma Data Sheet'!$A$3:$A$998=$E$3,ROW('Diploma Data Sheet'!$A$3:$A$998)),ROW(1:1))-2,3),\"\")","v":0},{"$f":"IFERROR(INDEX('Diploma Data Sheet'!$A$3:$E$998,SMALL(IF('Diploma Data Sheet'!$A$3:$A$998=$E$3,ROW('Diploma Data Sheet'!$A$3:$A$998)),ROW(1:1))-2,4),\"\")","v":0},null,{"$f":"IFERROR(IF(G8=\"\",\"\",VLOOKUP(G8,Points!$A$2:$B$6,2,FALSE)),\"\")","v":""},{"$f":"IFERROR(SUM(H8*(F8/10)),\"\")","v":""}]
[null,"Mandatory",{"$f":"IFERROR(INDEX('Diploma Data Sheet'!$A$3:$E$998,SMALL(IF('Diploma Data Sheet'!$A$3:$A$998=$E$3,ROW('Diploma Data Sheet'!$A$3:$A$998)),ROW(2:2))-2,5),\"\")","v":0},{"$f":"IFERROR(INDEX('Diploma Data Sheet'!$A$3:$E$998,SMALL(IF('Diploma Data Sheet'!$A$3:$A$998=$E$3,ROW('Diploma Data Sheet'!$A$3:$A$998)),ROW(2:2))-2,2),\"\")","v":0},{"$f":"IFERROR(INDEX('Diploma Data Sheet'!$A$3:$E$998,SMALL(IF('Diploma Data Sheet'!$A$3:$A$998=$E$3,ROW('Diploma Data Sheet'!$A$3:$A$998)),ROW(2:2))-2,3),\"\")","v":0},{"$f":"IFERROR(INDEX('Diploma Data Sheet'!$A$3:$E$998,SMALL(IF('Diploma Data Sheet'!$A$3:$A$998=$E$3,ROW('Diploma Data Sheet'!$A$3:$A$998)),ROW(2:2))-2,4),\"\")","v":0},null,{"$f":"IFERROR(IF(G9=\"\",\"\",VLOOKUP(G9,Points!$A$2:$B$6,2,FALSE)),\"\")","v":""},{"$f":"IFERROR(SUM(H9*(F9/10)),\"\")","v":""}]
[null,"Mandatory",{"$f":"IFERROR(INDEX('Diploma Data Sheet'!$A$3:$E$998,SMALL(IF('Diploma Data Sheet'!$A$3:$A$998=$E$3,ROW('Diploma Data Sheet'!$A$3:$A$998)),ROW(3:3))-2,5),\"\")","v":0},{"$f":"IFERROR(INDEX('Diploma Data Sheet'!$A$3:$E$998,SMALL(IF('Diploma Data Sheet'!$A$3:$A$998=$E$3,ROW('Diploma Data Sheet'!$A$3:$A$998)),ROW(3:3))-2,2),\"\")","v":0},{"$f":"IFERROR(INDEX('Diploma Data Sheet'!$A$3:$E$998,SMALL(IF('Diploma Data Sheet'!$A$3:$A$998=$E$3,ROW('Diploma Data Sheet'!$A$3:$A$998)),ROW(3:3))-2,3),\"\")","v":0},{"$f":"IFERROR(INDEX('Diploma Data Sheet'!$A$3:$E$998,SMALL(IF('Diploma Data Sheet'!$A$3:$A$998=$E$3,ROW('Diploma Data Sheet'!$A$3:$A$998)),ROW(3:3))-2,4),\"\")","v":0},null,{"$f":"IFERROR(IF(G10=\"\",\"\",VLOOKUP(G10,Points!$A$2:$B$6,2,FALSE)),\"\")","v":""},{"$f":"IFERROR(SUM(H10*(F10/10)),\"\")","v":""}]
[null,"Mandatory",{"$f":"IFERROR(INDEX('Diploma Data Sheet'!$A$3:$E$998,SMALL(IF('Diploma Data Sheet'!$A$3:$A$998=$E$3,ROW('Diploma Data Sheet'!$A$3:$A$998)),ROW(4:4))-2,5),\"\")","v":0},{"$f":"IFERROR(INDEX('Diploma Data Sheet'!$A$3:$E$998,SMALL(IF('Diploma Data Sheet'!$A$3:$A$998=$E$3,ROW('Diploma Data Sheet'!$A$3:$A$998)),ROW(4:4))-2,2),\"\")","v":0},{"$f":"IFERROR(INDEX('Diploma Data Sheet'!$A$3:$E$998,SMALL(IF('Diploma Data Sheet'!$A$3:$A$998=$E$3,ROW('Diploma Data Sheet'!$A$3:$A$998)),ROW(4:4))-2,3),\"\")","v":0},{"$f":"IFERROR(INDEX('Diploma Data Sheet'!$A$3:$E$998,SMALL(IF('Diploma Data Sheet'!$A$3:$A$998=$E$3,ROW('Diploma Data Sheet'!$A$3:$A$998)),ROW(4:4))-2,4),\"\")","v":0},null,{"$f":"IFERROR(IF(G11=\"\",\"\",VLOOKUP(G11,Points!$A$2:$B$6,2,FALSE)),\"\")","v":""},""]
[null,"Mandatory",{"$f":"IFERROR(INDEX('Diploma Data Sheet'!$A$3:$E$998,SMALL(IF('Diploma Data Sheet'!$A$3:$A$998=$E$3,ROW('Diploma Data Sheet'!$A$3:$A$998)),ROW(5:5))-2,5),\"\")","v":0},{"$f":"IFERROR(INDEX('Diploma Data Sheet'!$A$3:$E$998,SMALL(IF('Diploma Data Sheet'!$A$3:$A$998=$E$3,ROW('Diploma Data Sheet'!$A$3:$A$998)),ROW(5:5))-2,2),\"\")","v":0},{"$f":"IFERROR(INDEX('Diploma Data Sheet'!$A$3:$E$998,SMALL(IF('Diploma Data Sheet'!$A$3:$A$998=$E$3,ROW('Diploma Data Sheet'!$A$3:$A$998)),ROW(5:5))-2,3),\"\")","v":0},{"$f":"IFERROR(INDEX('Diploma Data Sheet'!$A$3:$E$998,SMALL(IF('Diploma Data Sheet'!$A$3:$A$998=$E$3,ROW('Diploma Data Sheet'!$A$3:$A$998)),ROW(5:5))-2,4),\"\")","v":0},null,{"$f":"IFERROR(IF(G12=\"\",\"\",VLOOKUP(G12,Points!$A$2:$B$6,2,FALSE)),\"\")","v":""},""]
[null,"Mandatory",{"$f":"IFERROR(INDEX('Diploma Data Sheet'!$A$3:$E$998,SMALL(IF('Diploma Data Sheet'!$A$3:$A$998=$E$3,ROW('Diploma Data Sheet'!$A$3:$A$998)),ROW(6:6))-2,5),\"\")","v":0},{"$f":"IFERROR(INDEX('Diploma Data Sheet'!$A$3:$E$998,SMALL(IF('Diploma Data Sheet'!$A$3:$A$998=$E$3,ROW('Diploma Data Sheet'!$A$3:$A$998)),ROW(6:6))-2,2),\"\")","v":0},{"$f":"IFERROR(INDEX('Diploma Data Sheet'!$A$3:$E$998,SMALL(IF('Diploma Data Sheet'!$A$3:$A$998=$E$3,ROW('Diploma Data Sheet'!$A$3:$A$998)),ROW(6:6))-2,3),\"\")","v":0},{"$f":"IFERROR(INDEX('Diploma Data Sheet'!$A$3:$E$998,SMALL(IF('Diploma Data Sheet'!$A$3:$A$998=$E$3,ROW('Diploma Data Sheet'!$A$3:$A$998)),ROW(6:6))-2,4),\"\")","v":0},null,{"$f":"IFERROR(IF(G13=\"\",\"\",VLOOKUP(G13,Points!$A$2:$B$6,2,FALSE)),\"\")","v":""},""]
[null,"Mandatory",{"$f":"IFERROR(INDEX('Diploma Data Sheet'!$A$3:$E$998,SMALL(IF('Diploma Data Sheet'!$A$3:$A$998=$E$3,ROW('Diploma Data Sheet'!$A$3:$A$998)),ROW(7:7))-2,5),\"\")","v":0},{"$f":"IFERROR(INDEX('Diploma Data Sheet'!$A$3:$E$998,SMALL(IF('Diploma Data Sheet'!$A$3:$A$998=$E$3,ROW('Diploma Data Sheet'!$A$3:$A$998)),ROW(7:7))-2,2),\"\")","v":0},{"$f":"IFERROR(INDEX('Diploma Data Sheet'!$A$3:$E$998,SMALL(IF('Diploma Data Sheet'!$A$3:$A$998=$E$3,ROW('Diploma Data Sheet'!$A$3:$A$998)),ROW(7:7))-2,3),\"\")","v":0},{"$f":"IFERROR(INDEX('Diploma Data Sheet'!$A$3:$E$998,SMALL(IF('Diploma Data Sheet'!$A$3:$A$998=$E$3,ROW('Diploma Data Sheet'!$A$3:$A$998)),ROW(7:7))-2,4),\"\")","v":0},null,{"$f":"IFERROR(IF(G14=\"\",\"\",VLOOKUP(G14,Points!$A$2:$B$6,2,FALSE)),\"\")","v":""},""]
[null,"Mandatory",{"$f":"IFERROR(INDEX('Diploma Data Sheet'!$A$3:$E$998,SMALL(IF('Diploma Data Sheet'!$A$3:$A$998=$E$3,ROW('Diploma Data Sheet'!$A$3:$A$998)),ROW(8:8))-2,5),\"\")","v":0},{"$f":"IFERROR(INDEX('Diploma Data Sheet'!$A$3:$E$998,SMALL(IF('Diploma Data Sheet'!$A$3:$A$998=$E$3,ROW('Diploma Data Sheet'!$A$3:$A$998)),ROW(8:8))-2,2),\"\")","v":0},{"$f":"IFERROR(INDEX('Diploma Data Sheet'!$A$3:$E$998,SMALL(IF('Diploma Data Sheet'!$A$3:$A$998=$E$3,ROW('Diploma Data Sheet'!$A$3:$A$998)),ROW(8:8))-2,3),\"\")","v":0},{"$f":"IFERROR(INDEX('Diploma Data Sheet'!$A$3:$E$998,SMALL(IF('Diploma Data Sheet'!$A$3:$A$998=$E$3,ROW('Diploma Data Sheet'!$A$3:$A$998)),ROW(8:8))-2,4),\"\")","v":0},null,{"$f":"IFERROR(IF(G15=\"\",\"\",VLOOKUP(G15,Points!$A$2:$B$6,2,FALSE)),\"\")","v":""},""]
[null,"Mandatory",{"$f":"IFERROR(INDEX('Diploma Data Sheet'!$A$3:$E$998,SMALL(IF('Diploma Data Sheet'!$A$3:$A$998=$E$3,ROW('Diploma Data Sheet'!$A$3:$A$998)),ROW(9:9))-2,5),\"\")","v":0},{"$f":"IFERROR(INDEX('Diploma Data Sheet'!$A$3:$E$998,SMALL(IF('Diploma Data Sheet'!$A$3:$A$998=$E$3,ROW('Diploma Data Sheet'!$A$3:$A$998)),ROW(9:9))-2,2),\"\")","v":0},{"$f":"IFERROR(INDEX('Diploma Data Sheet'!$A$3:$E$998,SMALL(IF('Diploma Data Sheet'!$A$3:$A$998=$E$3,ROW('Diploma Data Sheet'!$A$3:$A$998)),ROW(9:9))-2,3),\"\")","v":0},{"$f":"IFERROR(INDEX('Diploma Data Sheet'!$A$3:$E$998,SMALL(IF('Diploma Data Sheet'!$A$3:$A$998=$E$3,ROW('Diploma Data Sheet'!$A$3:$A$998)),ROW(9:9))-2,4),\"\")","v":0},null,{"$f":"IFERROR(IF(G16=\"\",\"\",VLOOKUP(G16,Points!$A$2:$B$6,2,FALSE)),\"\")","v":""},""]
[null,"Mandatory",{"$f":"IFERROR(INDEX('Diploma Data Sheet'!$A$3:$E$998,SMALL(IF('Diploma Data Sheet'!$A$3:$A$998=$E$3,ROW('Diploma Data Sheet'!$A$3:$A$998)),ROW(10:10))-2,5),\"\")","v":0},{"$f":"IFERROR(INDEX('Diploma Data Sheet'!$A$3:$E$998,SMALL(IF('Diploma Data Sheet'!$A$3:$A$998=$E$3,ROW('Diploma Data Sheet'!$A$3:$A$998)),ROW(10:10))-2,2),\"\")","v":0},{"$f":"IFERROR(INDEX('Diploma Data Sheet'!$A$3:$E$998,SMALL(IF('Diploma Data Sheet'!$A$3:$A$998=$E$3,ROW('Diploma Data Sheet'!$A$3:$A$998)),ROW(10:10))-2,3),\"\")","v":0},{"$f":"IFERROR(INDEX('Diploma Data Sheet'!$A$3:$E$998,SMALL(IF('Diploma Data Sheet'!$A$3:$A$998=$E$3,ROW('Diploma Data Sheet'!$A$3:$A$998)),ROW(10:10))-2,4),\"\")","v":0},null,{"$f":"IFERROR(IF(G17=\"\",\"\",VLOOKUP(G17,Points!$A$2:$B$6,2,FALSE)),\"\")","v":""},""]
[null,null,null,null,null,{"$f":"SUM(F8:F17)","v":0}]
[null,"Choose four to six optional units"]
[null,"Optional",{"$f":"IFERROR(INDEX('Diploma Data Sheet'!$L$3:$L$998,MATCH(Diploma!E20&$E$3,'Diploma Data Sheet'!$G$3:$G$998&'Diploma Data Sheet'!$H$3:$H$998,0)),\"\")","v":0},{"$f":"IFERROR(INDEX('Diploma Data Sheet'!$I$3:$I$998,MATCH(Diploma!E20&$E$3,'Diploma Data Sheet'!$G$3:$G$998&'Diploma Data Sheet'!$H$3:$H$998,0)),\"\")","v":0},null,{"$f":"IFERROR(INDEX('Diploma Data Sheet'!$K$3:$K$998,MATCH(Diploma!E20&$E$3,'Diploma Data Sheet'!$G$3:$G$998&'Diploma Data Sheet'!$H$3:$H$998,0)),\"\")","v":0},null,{"$f":"IFERROR(IF(G20=\"\",\"\",VLOOKUP(G20,Points!$A$2:$B$6,2,FALSE)),\"\")","v":""},""]
[null,"Optional",{"$f":"IFERROR(INDEX('Diploma Data Sheet'!$L$3:$L$998,MATCH(Diploma!E21&$E$3,'Diploma Data Sheet'!$G$3:$G$998&'Diploma Data Sheet'!$H$3:$H$998,0)),\"\")","v":0},{"$f":"IFERROR(INDEX('Diploma Data Sheet'!$I$3:$I$998,MATCH(Diploma!E21&$E$3,'Diploma Data Sheet'!$G$3:$G$998&'Diploma Data Sheet'!$H$3:$H$998,0)),\"\")","v":0},null,{"$f":"IFERROR(INDEX('Diploma Data Sheet'!$K$3:$K$998,MATCH(Diploma!E21&$E$3,'Diploma Data Sheet'!$G$3:$G$998&'Diploma Data Sheet'!$H$3:$H$998,0)),\"\")","v":0},null,{"$f":"IFERROR(IF(G21=\"\",\"\",VLOOKUP(G21,Points!$A$2:$B$6,2,FALSE)),\"\")","v":""},""]
[null,"Optional",{"$f":"IFERROR(INDEX('Diploma Data Sheet'!$L$3:$L$998,MATCH(Diploma!E22&$E$3,'Diploma Data Sheet'!$G$3:$G$998&'Diploma Data Sheet'!$H$3:$H$998,0)),\"\")","v":0},{"$f":"IFERROR(INDEX('Diploma Data Sheet'!$I$3:$I$998,MATCH(Diploma!E22&$E$3,'Diploma Data Sheet'!$G$3:$G$998&'Diploma Data Sheet'!$H$3:$H$998,0)),\"\")","v":0},null,{"$f":"IFERROR(INDEX('Diploma Data Sheet'!$K$3:$K$998,MATCH(Diploma!E22&$E$3,'Diploma Data Sheet'!$G$3:$G$998&'Diploma Data Sheet'!$H$3:$H$998,0)),\"\")","v":0},null,{"$f":"IFERROR(IF(G22=\"\",\"\",VLOOKUP(G22,Points!$A$2:$B$6,2,FALSE)),\"\")","v":""},""]
[null,"Optional",{"$f":"IFERROR(INDEX('Diploma Data Sheet'!$L$3:$L$998,MATCH(Diploma!E23&$E$3,'Diploma Data Sheet'!$G$3:$G$998&'Diploma Data Sheet'!$H$3:$H$998,0)),\"\")","v":0},{"$f":"IFERROR(INDEX('Diploma Data Sheet'!$I$3:$I$998,MATCH(Diploma!E23&$E$3,'Diploma Data Sheet'!$G$3:$G$998&'Diploma Data Sheet'!$H$3:$H$998,0)),\"\")","v":0},null,{"$f":"IFERROR(INDEX('Diploma Data Sheet'!$K$3:$K$998,MATCH(Diploma!E23&$E$3,'Diploma Data Sheet'!$G$3:$G$998&'Diploma Data Sheet'!$H$3:$H$998,0)),\"\")","v":0},null,{"$f":"IFERROR(IF(G23=\"\",\"\",VLOOKUP(G23,Points!$A$2:$B$6,2,FALSE)),\"\")","v":""},""]
[null,"Optional",{"$f":"IFERROR(INDEX('Diploma Data Sheet'!$L$3:$L$998,MATCH(Diploma!E24&$E$3,'Diploma Data Sheet'!$G$3:$G$998&'Diploma Data Sheet'!$H$3:$H$998,0)),\"\")","v":0},{"$f":"IFERROR(INDEX('Diploma Data Sheet'!$I$3:$I$998,MATCH(Diploma!E24&$E$3,'Diploma Data Sheet'!$G$3:$G$998&'Diploma Data Sheet'!$H$3:$H$998,0)),\"\")","v":0},null,{"$f":"IFERROR(INDEX('Diploma Data Sheet'!$K$3:$K$998,MATCH(Diploma!E24&$E$3,'Diploma Data Sheet'!$G$3:$G$998&'Diploma Data Sheet'!$H$3:$H$998,0)),\"\")","v":0},null,{"$f":"IFERROR(IF(G24=\"\",\"\",VLOOKUP(G24,Points!$A$2:$B$6,2,FALSE)),\"\")","v":""},""]
[null,"Optional",{"$f":"IFERROR(INDEX('Diploma Data Sheet'!$L$3:$L$998,MATCH(Diploma!E25&$E$3,'Diploma Data Sheet'!$G$3:$G$998&'Diploma Data Sheet'!$H$3:$H$998,0)),\"\")","v":0},{"$f":"IFERROR(INDEX('Diploma Data Sheet'!$I$3:$I$998,MATCH(Diploma!E25&$E$3,'Diploma Data Sheet'!$G$3:$G$998&'Diploma Data Sheet'!$H$3:$H$998,0)),\"\")","v":0},null,{"$f":"IFERROR(INDEX('Diploma Data Sheet'!$K$3:$K$998,MATCH(Diploma!E25&$E$3,'Diploma Data Sheet'!$G$3:$G$998&'Diploma Data Sheet'!$H$3:$H$998,0)),\"\")","v":0},null,{"$f":"IFERROR(IF(G25=\"\",\"\",VLOOKUP(G25,Points!$A$2:$B$6,2,FALSE)),\"\")","v":""},""]
[null,"Optional",{"$f":"IFERROR(INDEX('Diploma Data Sheet'!$L$3:$L$998,MATCH(Diploma!E26&$E$3,'Diploma Data Sheet'!$G$3:$G$998&'Diploma Data Sheet'!$H$3:$H$998,0)),\"\")","v":0},{"$f":"IFERROR(INDEX('Diploma Data Sheet'!$I$3:$I$998,MATCH(Diploma!E26&$E$3,'Diploma Data Sheet'!$G$3:$G$998&'Diploma Data Sheet'!$H$3:$H$998,0)),\"\")","v":0},null,{"$f":"IFERROR(INDEX('Diploma Data Sheet'!$K$3:$K$998,MATCH(Diploma!E26&$E$3,'Diploma Data Sheet'!$G$3:$G$998&'Diploma Data Sheet'!$H$3:$H$998,0)),\"\")","v":0},null,{"$f":"IFERROR(IF(G26=\"\",\"\",VLOOKUP(G26,Points!$A$2:$B$6,2,FALSE)),\"\")","v":""},""]
[null,"Optional",{"$f":"IFERROR(INDEX('Diploma Data Sheet'!$L$3:$L$998,MATCH(Diploma!E27&$E$3,'Diploma Data Sheet'!$G$3:$G$998&'Diploma Data Sheet'!$H$3:$H$998,0)),\"\")","v":0},{"$f":"IFERROR(INDEX('Diploma Data Sheet'!$I$3:$I$998,MATCH(Diploma!E27&$E$3,'Diploma Data Sheet'!$G$3:$G$998&'Diploma Data Sheet'!$H$3:$H$998,0)),\"\")","v":0},null,{"$f":"IFERROR(INDEX('Diploma Data Sheet'!$K$3:$K$998,MATCH(Diploma!E27&$E$3,'Diploma Data Sheet'!$G$3:$G$998&'Diploma Data Sheet'!$H$3:$H$998,0)),\"\")","v":0},null,{"$f":"IFERROR(IF(G27=\"\",\"\",VLOOKUP(G27,Points!$A$2:$B$6,2,FALSE)),\"\")","v":""},""]
[null,"Optional",{"$f":"IFERROR(INDEX('Diploma Data Sheet'!$L$3:$L$998,MATCH(Diploma!E28&$E$3,'Diploma Data Sheet'!$G$3:$G$998&'Diploma Data Sheet'!$H$3:$H$998,0)),\"\")","v":0},{"$f":"IFERROR(INDEX('Diploma Data Sheet'!$I$3:$I$998,MATCH(Diploma!E28&$E$3,'Diploma Data Sheet'!$G$3:$G$998&'Diploma Data Sheet'!$H$3:$H$998,0)),\"\")","v":0},null,{"$f":"IFERROR(INDEX('Diploma Data Sheet'!$K$3:$K$998,MATCH(Diploma!E28&$E$3,'Diploma Data Sheet'!$G$3:$G$998&'Diploma Data Sheet'!$H$3:$H$998,0)),\"\")","v":0},null,{"$f":"IFERROR(IF(G28=\"\",\"\",VLOOKUP(G28,Points!$A$2:$B$6,2,FALSE)),\"\")","v":""},""]
[null,"Optional",{"$f":"IFERROR(INDEX('Diploma Data Sheet'!$L$3:$L$998,MATCH(Diploma!E29&$E$3,'Diploma Data Sheet'!$G$3:$G$998&'Diploma Data Sheet'!$H$3:$H$998,0)),\"\")","v":0},{"$f":"IFERROR(INDEX('Diploma Data Sheet'!$I$3:$I$998,MATCH(Diploma!E29&$E$3,'Diploma Data Sheet'!$G$3:$G$998&'Diploma Data Sheet'!$H$3:$H$998,0)),\"\")","v":0},null,{"$f":"IFERROR(INDEX('Diploma Data Sheet'!$K$3:$K$998,MATCH(Diploma!E29&$E$3,'Diploma Data Sheet'!$G$3:$G$998&'Diploma Data Sheet'!$H$3:$H$998,0)),\"\")","v":0},null,{"$f":"IFERROR(IF(G29=\"\",\"\",VLOOKUP(G29,Points!$A$2:$B$6,2,FALSE)),\"\")","v":""},""]
[null,null,null,null,null,{"$f":"SUM(F20:F29)","v":0}]
[null,"Choose a maximum of two units from Group B"]
[null,"Optional",{"$f":"IFERROR(INDEX('Diploma Data Sheet'!$S$3:$S$998,MATCH(Diploma!E32&$E$3,'Diploma Data Sheet'!$N$3:$N$998&'Diploma Data Sheet'!$O$3:$O$998,0)),\"\")","v":0},{"$f":"IFERROR(INDEX('Diploma Data Sheet'!$P$3:$P$998,MATCH(Diploma!E32&$E$3,'Diploma Data Sheet'!$N$3:$N$998&'Diploma Data Sheet'!$O$3:$O$998,0)),\"\")","v":0},null,{"$f":"IFERROR(INDEX('Diploma Data Sheet'!$R$3:$R$998,MATCH(Diploma!E32&$E$3,'Diploma Data Sheet'!$N$3:$N$998&'Diploma Data Sheet'!$O$3:$O$998,0)),\"\")","v":0},null,{"$f":"IFERROR(IF(G32=\"\",\"\",VLOOKUP(G32,Points!$A$2:$B$6,2,FALSE)),\"\")","v":""},""]
[null,"Optional",{"$f":"IFERROR(INDEX('Diploma Data Sheet'!$S$3:$S$998,MATCH(Diploma!E33&$E$3,'Diploma Data Sheet'!$N$3:$N$998&'Diploma Data Sheet'!$O$3:$O$998,0)),\"\")","v":0},{"$f":"IFERROR(INDEX('Diploma Data Sheet'!$P$3:$P$998,MATCH(Diploma!E33&$E$3,'Diploma Data Sheet'!$N$3:$N$998&'Diploma Data Sheet'!$O$3:$O$998,0)),\"\")","v":0},null,{"$f":"IFERROR(INDEX('Diploma Data Sheet'!$R$3:$R$998,MATCH(Diploma!E33&$E$3,'Diploma Data Sheet'!$N$3:$N$998&'Diploma Data Sheet'!$O$3:$O$998,0)),\"\")","v":0},null,{"$f":"IFERROR(IF(G33=\"\",\"\",VLOOKUP(G33,Points!$A$2:$B$6,2,FALSE)),\"\")","v":""},""]
[null,"Optional",{"$f":"IFERROR(INDEX('Diploma Data Sheet'!$S$3:$S$998,MATCH(Diploma!E34&$E$3,'Diploma Data Sheet'!$N$3:$N$998&'Diploma Data Sheet'!$O$3:$O$998,0)),\"\")","v":0},{"$f":"IFERROR(INDEX('Diploma Data Sheet'!$P$3:$P$998,MATCH(Diploma!E34&$E$3,'Diploma Data Sheet'!$N$3:$N$998&'Diploma Data Sheet'!$O$3:$O$998,0)),\"\")","v":0},null,{"$f":"IFERROR(INDEX('Diploma Data Sheet'!$R$3:$R$998,MATCH(Diploma!E34&$E$3,'Diploma Data Sheet'!$N$3:$N$998&'Diploma Data Sheet'!$O$3:$O$998,0)),\"\")","v":0},null,{"$f":"IFERROR(IF(G34=\"\",\"\",VLOOKUP(G34,Points!$A$2:$B$6,2,FALSE)),\"\")","v":""},""]
[null,"Optional",{"$f":"IFERROR(INDEX('Diploma Data Sheet'!$S$3:$S$998,MATCH(Diploma!E35&$E$3,'Diploma Data Sheet'!$N$3:$N$998&'Diploma Data Sheet'!$O$3:$O$998,0)),\"\")","v":0},{"$f":"IFERROR(INDEX('Diploma Data Sheet'!$P$3:$P$998,MATCH(Diploma!E35&$E$3,'Diploma Data Sheet'!$N$3:$N$998&'Diploma Data Sheet'!$O$3:$O$998,0)),\"\")","v":0},null,{"$f":"IFERROR(INDEX('Diploma Data Sheet'!$R$3:$R$998,MATCH(Diploma!E35&$E$3,'Diploma Data Sheet'!$N$3:$N$998&'Diploma Data Sheet'!$O$3:$O$998,0)),\"\")","v":0},null,{"$f":"IFERROR(IF(G35=\"\",\"\",VLOOKUP(G35,Points!$A$2:$B$6,2,FALSE)),\"\")","v":""},""]
[null,"Optional",{"$f":"IFERROR(INDEX('Diploma Data Sheet'!$S$3:$S$998,MATCH(Diploma!E36&$E$3,'Diploma Data Sheet'!$N$3:$N$998&'Diploma Data Sheet'!$O$3:$O$998,0)),\"\")","v":0},{"$f":"IFERROR(INDEX('Diploma Data Sheet'!$P$3:$P$998,MATCH(Diploma!E36&$E$3,'Diploma Data Sheet'!$N$3:$N$998&'Diploma Data Sheet'!$O$3:$O$998,0)),\"\")","v":0},null,{"$f":"IFERROR(INDEX('Diploma Data Sheet'!$R$3:$R$998,MATCH(Diploma!E36&$E$3,'Diploma Data Sheet'!$N$3:$N$998&'Diploma Data Sheet'!$O$3:$O$998,0)),\"\")","v":0},null,{"$f":"IFERROR(IF(G36=\"\",\"\",VLOOKUP(G36,Points!$A$2:$B$6,2,FALSE)),\"\")","v":""},""]
[null,"Optional",{"$f":"IFERROR(INDEX('Diploma Data Sheet'!$S$3:$S$998,MATCH(Diploma!E37&$E$3,'Diploma Data Sheet'!$N$3:$N$998&'Diploma Data Sheet'!$O$3:$O$998,0)),\"\")","v":0},{"$f":"IFERROR(INDEX('Diploma Data Sheet'!$P$3:$P$998,MATCH(Diploma!E37&$E$3,'Diploma Data Sheet'!$N$3:$N$998&'Diploma Data Sheet'!$O$3:$O$998,0)),\"\")","v":0},null,{"$f":"IFERROR(INDEX('Diploma Data Sheet'!$R$3:$R$998,MATCH(Diploma!E37&$E$3,'Diploma Data Sheet'!$N$3:$N$998&'Diploma Data Sheet'!$O$3:$O$998,0)),\"\")","v":0},null,{"$f":"IFERROR(IF(G37=\"\",\"\",VLOOKUP(G37,Points!$A$2:$B$6,2,FALSE)),\"\")","v":""},""]
[null,"Optional",{"$f":"IFERROR(INDEX('Diploma Data Sheet'!$S$3:$S$998,MATCH(Diploma!E38&$E$3,'Diploma Data Sheet'!$N$3:$N$998&'Diploma Data Sheet'!$O$3:$O$998,0)),\"\")","v":0},{"$f":"IFERROR(INDEX('Diploma Data Sheet'!$P$3:$P$998,MATCH(Diploma!E38&$E$3,'Diploma Data Sheet'!$N$3:$N$998&'Diploma Data Sheet'!$O$3:$O$998,0)),\"\")","v":0},null,{"$f":"IFERROR(INDEX('Diploma Data Sheet'!$R$3:$R$998,MATCH(Diploma!E38&$E$3,'Diploma Data Sheet'!$N$3:$N$998&'Diploma Data Sheet'!$O$3:$O$998,0)),\"\")","v":0},null,{"$f":"IFERROR(IF(G38=\"\",\"\",VLOOKUP(G38,Points!$A$2:$B$6,2,FALSE)),\"\")","v":""},""]
[null,"Optional",{"$f":"IFERROR(INDEX('Diploma Data Sheet'!$S$3:$S$998,MATCH(Diploma!E39&$E$3,'Diploma Data Sheet'!$N$3:$N$998&'Diploma Data Sheet'!$O$3:$O$998,0)),\"\")","v":0},{"$f":"IFERROR(INDEX('Diploma Data Sheet'!$P$3:$P$998,MATCH(Diploma!E39&$E$3,'Diploma Data Sheet'!$N$3:$N$998&'Diploma Data Sheet'!$O$3:$O$998,0)),\"\")","v":0},null,{"$f":"IFERROR(INDEX('Diploma Data Sheet'!$R$3:$R$998,MATCH(Diploma!E39&$E$3,'Diploma Data Sheet'!$N$3:$N$998&'Diploma Data Sheet'!$O$3:$O$998,0)),\"\")","v":0},null,{"$f":"IFERROR(IF(G39=\"\",\"\",VLOOKUP(G39,Points!$A$2:$B$6,2,FALSE)),\"\")","v":""},""]
[null,"Optional",{"$f":"IFERROR(INDEX('Diploma Data Sheet'!$S$3:$S$998,MATCH(Diploma!E40&$E$3,'Diploma Data Sheet'!$N$3:$N$998&'Diploma Data Sheet'!$O$3:$O$998,0)),\"\")","v":0},{"$f":"IFERROR(INDEX('Diploma Data Sheet'!$P$3:$P$998,MATCH(Diploma!E40&$E$3,'Diploma Data Sheet'!$N$3:$N$998&'Diploma Data Sheet'!$O$3:$O$998,0)),\"\")","v":0},null,{"$f":"IFERROR(INDEX('Diploma Data Sheet'!$R$3:$R$998,MATCH(Diploma!E40&$E$3,'Diploma Data Sheet'!$N$3:$N$998&'Diploma Data Sheet'!$O$3:$O$998,0)),\"\")","v":0},null,{"$f":"IFERROR(IF(G40=\"\",\"\",VLOOKUP(G40,Points!$A$2:$B$6,2,FALSE)),\"\")","v":""},""]
[null,"Optional",{"$f":"IFERROR(INDEX('Diploma Data Sheet'!$S$3:$S$998,MATCH(Diploma!E41&$E$3,'Diploma Data Sheet'!$N$3:$N$998&'Diploma Data Sheet'!$O$3:$O$998,0)),\"\")","v":0},{"$f":"IFERROR(INDEX('Diploma Data Sheet'!$P$3:$P$998,MATCH(Diploma!E41&$E$3,'Diploma Data Sheet'!$N$3:$N$998&'Diploma Data Sheet'!$O$3:$O$998,0)),\"\")","v":0},null,{"$f":"IFERROR(INDEX('Diploma Data Sheet'!$R$3:$R$998,MATCH(Diploma!E41&$E$3,'Diploma Data Sheet'!$N$3:$N$998&'Diploma Data Sheet'!$O$3:$O$998,0)),\"\")","v":0},null,{"$f":"IFERROR(IF(G41=\"\",\"\",VLOOKUP(G41,Points!$A$2:$B$6,2,FALSE)),\"\")","v":""},""]
[null,null,null,null,null,{"$f":"SUM(F32:F41)","v":0}]
[null,null,null,null,null,{"$f":"SUM(F18+F30+F42)","v":0},"Overall Grade",null,{"$f":"IFERROR(IF($I$44=\"\",\"\",VLOOKUP($I$44,Points!$N$2:$O$10,2,TRUE)),\"\")","v":"U"}]
[null,null,null,null,null,null,"Points",null,{"$f":"SUM(I8:I41)","v":0}]

{"sheet":"Award Data Sheet","index":5,"n_rows":86,"n_cols":12,"rows_kept":86,"cut":false,"hidden":true,"merged":[]}
["Mandatory units",null,null,null,null,null,null,"optional Units A"]
["Sector","Unit number","Unit Name","GLH","Assessment type",null,null,"Sector","Unit Number","Unit Name","GLH","Assessment type"]
["Application of Science",5,"Application of Chemical Substances",30,"Internal","Mandatory","Communicating Ideas in 2D","Art and Design",3,"Communicating Ideas in 2D",30,"Internal"]
["Application of Science",6,"Application of Physical Science",30,"Internal","Mandatory","Communicating Ideas in 3D","Art and Design",4,"Communicating Ideas in 3D",30,"Internal"]
["Application of Science",7,"Health Applications of Life Science",30,"Internal","Mandatory","Developing an Art and Design Portfolio","Art and Design",5,"Developing an Art and Design Portfolio",30,"Internal"]
["Application of Science",8,"Scientific Skills",30,"External","Mandatory","Investigating Contextual References in Art and Design","Art and Design",6,"Investigating Contextual References in Art and Design",30,"Internal"]
["Principles of Applied Science",1,"Principles of Science",30,"External","Mandatory","Promoting a Brand","Business 2012",3,"Promoting a Brand",30,"Internal"]
["Principles of Applied Science",2,"Chemistry and Our Earth",30,"Internal","Mandatory","Principles of Customer Services","Business 2012",4,"Principles of Customer Services",30,"Internal"]
["Principles of Applied Science",3,"Energy and Our Universe",30,"Internal","Mandatory","Sales and Personal Selling","Business 2012",5,"Sales and Personal Selling",30,"Internal"]
["Principles of Applied Science",4,"Biology and Our Environment",30,"Internal","Mandatory","Introducing Retail Business","Business 2012",6,"Introducing Retail Business",30,"Internal"]
["Art and Design",1,"Introduction to Specialist Pathways in Art and Design",30,"Internal","Core","Providing Business Support","Business 2012",7,"Providing Business Support",30,"Internal"]
["Art and Design",2,"Creative Project in Art and Design",30,"External","Core","Recruitment, Selection and Employment","Business 2012",8,"Recruitment, Selection and Employment",30,"Internal"]
["Business 2012",1,"Enterprise in the Business World",30,"Internal","Core","Promoting a Brand","Business 2018",4,"Promoting a Brand",30,"Internal"]
["Business 2012",2,"Finance for Business",30,"External","Core","Principles of Customer Services","Business 2018",5,"Principles of Customer Services",30,"Internal"]
["Business 2018",1,"Introduction to Business",30,"Internal","Mandatory","Recruitment, Selection and Employment","Business 2018",6,"Recruitment, Selection and Employment",30,"Internal"]
["Business 2018",2,"Finance for Business",30,"External","Mandatory","Construction Processes and Operations","Construction and the Built Environment 2013",4,"Construction Processes and Operations",30,"Internal"]
["Business 2018",3,"Enterprise in the Business World",30,"Internal","Mandatory","Construction Drawing Techniques","Construction and the Built Environment 2013",5,"Construction Drawing Techniques",30,"Internal"]
["Construction and the Built Environment 2013",1,"Construction Technology",30,"External","Core","Exploring Carpentry and Joinery Principles and Techniques","Construction and the Built Environment 2013",6,"Exploring Carpentry and Joinery Principles and Techniques",30,"Internal"]
["Construction and the Built Environment 2013",2,"Construction and Design",30,"Internal","Core","Exploring Brickwork and Blockwork Principles and Techniques","Construction and the Built Environment 2013",7,"Exploring Brickwork and Blockwork Principles and Techniques",30,"Internal"]
["Construction and the Built Environment 2013",3,"Scientific and Mathematical Applications for Construction",30,"Internal","Mandatory","Exploring Painting and Decorating Principles and Techniques","Construction and the Built Environment 2013",8,"Exploring Painting and Decorating Principles and Techniques",30,"Internal"]
["Construction and the Built Environment 2018",1,"Construction Technology",30,"External","Mandatory","Exploring Plumbing Principles and Techniques","Construction and the Built Environment 2013",9,"Exploring Plumbing Principles and Techniques",30,"Internal"]
["Construction and the Built Environment 2018",2,"Scientific and Mathematical Applications for Construction",30,"Internal","Mandatory","Exploring Electrical Principles and Techniques","Construction and the Built Environment 2013",10,"Exploring Electrical Principles and Techniques",30,"Internal"]
["Construction and the Built Environment 2018",3,"Construction and Design",30,"Internal","Mandatory","Construction Drawing Techniques","Construction and the Built Environment 2018",4,"Construction Drawing Techniques",30,"Internal"]
["Creative Digital Media Production",1,"Digital Media Sectors and Audiences",30,"External","Core","Exploring Carpentry and Joinery Principles and Techniques","Construction and the Built Environment 2018",5,"Exploring Carpentry and Joinery Principles and Techniques",30,"Internal"]
["Creative Digital Media Production",2,"Planning and Pitching a Digital Media Product",30,"Internal","Core","Exploring Brickwork and Blockwork Principles and Techniques","Construction and the Built Environment 2018",6,"Exploring Brickwork and Blockwork Principles and Techniques",30,"Internal"]
["Engineering",1,"The Engineered World",30,"External","Core","Exploring Painting and Decorating Principles and Techniques","Construction and the Built Environment 2018",7,"Exploring Painting and Decorating Principles and Techniques",30,"Internal"]
["Engineering",2,"Investigating an Engineered Product",30,"Internal","Core","Exploring Plumbing Principles and Techniques","Construction and the Built Environment 2018",8,"Exploring Plumbing Principles and Techniques",30,"Internal"]
["Engineering Design and Product Investigation",2,"Investigating an Engineered Product",30,"Internal","Core","Exploring Electrical Principles and Techniques","Construction and the Built Environment 2018",9,"Exploring Electrical Principles and Techniques",30,"Internal"]
["Engineering Design and Product Investigation",9,"Interpreting and Using Engineering Information",30,"External","Core","Digital Moving Image Production","Creative Digital Media Production",3,"Digital Moving Image Production",30,"Internal"]
["Engineering Design and Product Investigation",12,"Engineering Design",60,"Internal","Mandatory","Digital Audio Production","Creative Digital Media Production",4,"Digital Audio Production",30,"Internal"]
["Engineering Electronics and Computer Control Technologies",1,"The Engineered World",30,"External","Core","Digital Publishing Production","Creative Digital Media Production",5,"Digital Publishing Production",30,"Internal"]
["Engineering Electronics and Computer Control Technologies",36,"Electrical and Electronic Circuit Construction and Testing",30,"Internal","Core","Website Production","Creative Digital Media Production",6,"Website Production",30,"Internal"]
["Engineering Electronics and Computer Control Technologies",37,"Computer Applications in Engineering",60,"Internal","Mandatory","Digital Games Production","Creative Digital Media Production",7,"Digital Games Production",30,"Internal"]
["Engineering Materials and Manufacturing",4,"Engineering Maintenance",30,"Internal","Core","Health and Safety in Engineering","Engineering",3,"Health and Safety in Engineering",30,"Internal"]
["Engineering Materials and Manufacturing",38,"Materials Used in Engineered Products",30,"External","Core","Engineering Maintenance","Engineering",4,"Engineering Maintenance",30,"Internal"]
["Engineering Materials and Manufacturing",31,"Production Planning for Engineering",30,"Internal","Mandatory","Engineering Materials","Engineering",5,"Engineering Materials",30,"Internal"]
["Engineering Materials and Manufacturing",39,"Program and Use a Computer Numerical Control (CNC) Machine",30,"Internal","Mandatory","Computer-aided Engineering","Engineering",6,"Computer-aided Engineering",30,"Internal"]
["Equine Studies",1,"Equine Health and Welfare",30,"External","Core","Machining Techniques","Engineering",7,"Machining Techniques",60,"Internal"]
["Equine Studies",2,"Equine Husbandry",30,"Internal","Core","Electronic Circuit Design and Construction","Engineering",8,"Electronic Circuit Design and Construction",60,"Internal"]
["Health and Social Care",1,"Human Lifespan Development",30,"External","Core","Horse Handling","Equine Studies",3,"Horse Handling",30,"Internal"]
["Health and Social Care",2,"Health and Social Care Values",30,"Internal","Core","Equine Behaviour","Equine Studies",4,"Equine Behaviour",30,"Internal"]
["Hospitality",1,"Introducing the Hospitality Industry",30,"External","Core","Equine Tack, Equipment and Clothing","Equine Studies",5,"Equine Tack, Equipment and Clothing",30,"Internal"]
["Hospitality",2,"Working in the Hospitality Industry",30,"Internal","Core","Effective Communication in Health and Social Care","Health and Social Care",3,"Effective Communication in Health and Social Care",30,"Internal"]
["Hospitality",3,"Food Safety and Health and Safety in Hospitality",30,"Internal","Mandatory","Social Influences on Health and Wellbeing","Health and Social Care",4,"Social Influences on Health and Wellbeing",30,"Internal"]
["Information and Creative Technology",1,"The Online World",30,"External","Core","Promoting Health and Wellbeing","Health and Social Care",5,"Promoting Health and Wellbeing",30,"Internal"]
["Information and Creative Technology",3,"A Digital Portfolio",30,"Internal","Core","The Impact of Nutrition on Health and Wellbeing","Health and Social Care",6,"The Impact of Nutrition on Health and Wellbeing",30,"Internal"]
["Music",1,"The Music Industry",30,"External","Core","Equality and Diversity in Health and Social Care","Health and Social Care",7,"Equality and Diversity in Health and Social Care",30,"Internal"]
["Music",2,"Managing a Music Product",30,"Internal","Core","Individual Rights in Health and Social Care","Health and Social Care",8,"Individual Rights in Health and Social Care",30,"Internal"]
["Performing Arts",1,"Individual Showcase",30,"External","Core","Costing and Controlling Finances in the Hospitality Industry","Hospitality",4,"Costing and Controlling Finances in the Hospitality Industry",30,"Internal"]
["Performing Arts",2,"Preparation, Performance and Production",30,"Internal","Core","Enterprise in the Hospitality Industry","Hospitality",5,"Enterprise in the Hospitality Industry",30,"Internal"]
["Public Services",1,"The Role and Work of the Public Services",30,"External","Core","Planning, Preparing, Cooking and Finishing Food","Hospitality",6,"Planning, Preparing, Cooking and Finishing Food",30,"Internal"]
["Public Services",2,"Working Skills in the Public Services Sector",30,"Internal","Core","Food and Beverage Service in the Hospitality Industry","Hospitality",7,"Food and Beverage Service in the Hospitality Industry",30,"Internal"]
["Sport 2012",1,"Fitness for Sport and Exercise",30,"External","Core","Front Office Services in the Hospitality Industry","Hospitality",8,"Front Office Services in the Hospitality Industry",30,"Internal"]
["Sport 2012",2,"Practical Sports Performance",30,"Internal","Core","Creating Digital Animation","Information and Creative Technology",4,"Creating Digital Animation",30,"Internal"]
["Sport 2018",1,"Fitness for Sport and Exercise",30,"External","Mandatory","Creating Digital Audio","Information and Creative Technology",5,"Creating Digital Audio",30,"Internal"]
["Sport 2018",2,"Practical Sports Performance",30,"Internal","Mandatory","Creating Digital Graphics","Information and Creative Technology",6,"Creating Digital Graphics",30,"Internal"]
["Sport 2018",3,"Applying the Principles of Personal Training",30,"Internal","Mandatory","Creating Digital Video","Information and Creative Technology",7,"Creating Digital Video",30,"Internal"]
["Travel and Tourism 2013",1,"The UK Travel and Tourism Sector",30,"External","Core","Spreadsheet Development","Information and Creative Technology",9,"Spreadsheet Development",30,"Internal"]
["Travel and Tourism 2013",2,"UK Travel and Tourism Destinations",30,"Internal","Core","Database Development","Information and Creative Technology",10,"Database Development",60,"Internal"]
["Travel and Tourism 2018",1,"The UK Travel and Tourism Sector",30,"External","Mandatory","Website Development","Information and Creative Technology",13,"Website Development",60,"Internal"]
["Travel and Tourism 2018",2,"UK Travel and Tourism Destinations",30,"Internal","Mandatory","Introducing Live Sound","Music",3,"Introducing Live Sound",30,"Internal"]
["Travel and Tourism 2018",3,"The Travel and Tourism Customer Experience",30,"Internal","Mandatory","Introducing Music Composition","Music",4,"Introducing Music Composition",30,"Internal"]
["CPLD",1,"Patterns of Child Development",30,"External","Core","Introducing Music Performance","Music",5,"Introducing Music Performance",30,"Internal"]
["CPLD",2,"Promoting Children’s Development Through Play",30,"Internal","Core","Introducing Music Recording","Music",6,"Introducing Music Recording",30,"Internal"]
["CPLD",3,"The Principles of Early Years Practice",60,"Internal","Mandatory","Introducing Music Sequencing","Music",7,"Introducing Music Sequencing",30,"Internal"]
[null,null,null,null,null,null,"Acting Skills","Performing Arts",3,"Acting Skills",60,"Internal"]
[null,null,null,null,null,null,"Dance Skills","Performing Arts",4,"Dance Skills",60,"Internal"]
[null,null,null,null,null,null,"Musical Theatre Skills","Performing Arts",5,"Musical Theatre Skills",60,"Internal"]
[null,null,null,null,null,null,"Music Performance Skills","Performing Arts",6,"Music Performance Skills",60,"Internal"]
[null,null,null,null,null,null,"Production Skills for Performance","Performing Arts",7,"Production Skills for Performance",60,"Internal"]
[null,null,null,null,null,null,"Employment in the Public Services","Public Services",3,"Employment in the Public Services",30,"Internal"]
[null,null,null,null,null,null,"Public Services and Community Protection","Public Services",4,"Public Services and Community Protection",30,"Internal"]
[null,null,null,null,null,null,"Health, Fitness and Lifestyle for the Public Services","Public Services",5,"Health, Fitness and Lifestyle for the Public Services",30,"Internal"]
[null,null,null,null,null,null,"The Mind and Sports Performance","Sport 2012",3,"The Mind and Sports Performance",30,"Internal"]
[null,null,null,null,null,null,"The Sports Performer in Action","Sport 2012",4,"The Sports Performer in Action",30,"Internal"]
[null,null,null,null,null,null,"Training for Personal Fitness","Sport 2012",5,"Training for Personal Fitness",30,"Internal"]
[null,null,null,null,null,null,"Leading Sports Activities","Sport 2012",6,"Leading Sports Activities",30,"Internal"]
[null,null,null,null,null,null,"The Mind and Sports Performance","Sport 2018",4,"The Mind and Sports Performance",30,"Internal"]
[null,null,null,null,null,null,"The Sports Performer in Action","Sport 2018",5,"The Sports Performer in Action",30,"Internal"]
[null,null,null,null,null,null,"Leading Sports Activities","Sport 2018",6,"Leading Sports Activities",30,"Internal"]
[null,null,null,null,null,null,"The Development of Travel and Tourism in the UK","Travel and Tourism 2013",3,"The Development of Travel and Tourism in the UK",30,"Internal"]
[null,null,null,null,null,null,"International Travel and Tourism Destinations","Travel and Tourism 2013",4,"International Travel and Tourism Destinations",30,"Internal"]
[null,null,null,null,null,null,"Factors Affecting Worldwide Travel and Tourism","Travel and Tourism 2013",5,"Factors Affecting Worldwide Travel and Tourism",30,"Internal"]
[null,null,null,null,null,null,"The Travel and Tourism Customer Experience","Travel and Tourism 2013",6,"The Travel and Tourism Customer Experience",30,"Internal"]
[null,null,null,null,null,null,"International Travel and Tourism Destinations","Travel and Tourism 2018",4,"International Travel and Tourism Destinations",30,"Internal"]
[null,null,null,null,null,null,"Factors Affecting Worldwide Travel and Tourism","Travel and Tourism 2018",5,"Factors Affecting Worldwide Travel and Tourism",30,"Internal"]

{"sheet":"Award Dropdown","index":6,"n_rows":8,"n_cols":71,"rows_kept":8,"cut":false,"hidden":true,"merged":[]}
["Art and Design A",null,null,null,"Business 2012 A",null,null,null,"Business 2018 A",null,null,null,"Construction 2013",null,null,null,"Construction 2018",null,null,null,"Media",null,null,null,"Engineering",null,null,null,"Equine Studies",null,null,null,"HSC",null,null,null,"Hospitlaity",null,null,null,"ICT",null,null,null,"Music",null,null,null,"Perf Arts",null,null,null,"Public Services",null,null,null,"Sport 2012",null,null,null,"Sport 2018",null,null,null,"Travel 2013",null,null,null,"Travel 2018"]
["Communicating Ideas in 2D",{"$f":"IF(COUNTIF(Award!$E$20:$E$83,A2)>=1,\"\",ROW())","v":2},{"$f":"IF(ROW(A2)-ROW(A$2)+1>COUNT(B$2:B$50),\"\",INDEX(A:A,SMALL(B$2:B$50,1+ROW(A2)-ROW(A$2))))","v":"Communicating Ideas in 2D"},null,"Promoting a Brand",{"$f":"IF(COUNTIF(Award!$E$20:$E$83,E2)>=1,\"\",ROW())","v":2},{"$f":"IF(ROW(E2)-ROW(E$2)+1>COUNT(F$2:F$50),\"\",INDEX(E:E,SMALL(F$2:F$50,1+ROW(E2)-ROW(E$2))))","v":"Promoting a Brand"},null,"Promoting a Brand",{"$f":"IF(COUNTIF(Award!$E$20:$E$83,I2)>=1,\"\",ROW())","v":2},{"$f":"IF(ROW(I2)-ROW(I$2)+1>COUNT(J$2:J$50),\"\",INDEX(I:I,SMALL(J$2:J$50,1+ROW(I2)-ROW(I$2))))","v":"Promoting a Brand"},null,"Construction Processes and Operations",{"$f":"IF(COUNTIF(Award!$E$20:$E$83,M2)>=1,\"\",ROW())","v":2},{"$f":"IF(ROW(M2)-ROW(M$2)+1>COUNT(N$2:N$50),\"\",INDEX(M:M,SMALL(N$2:N$50,1+ROW(M2)-ROW(M$2))))","v":"Construction Processes and Operations"},null,"Construction Drawing Techniques",{"$f":"IF(COUNTIF(Award!$E$20:$E$83,Q2)>=1,\"\",ROW())","v":2},{"$f":"IF(ROW(Q2)-ROW(Q$2)+1>COUNT(R$2:R$50),\"\",INDEX(Q:Q,SMALL(R$2:R$50,1+ROW(Q2)-ROW(Q$2))))","v":"Construction Drawing Techniques"},null,"Digital Moving Image Production",{"$f":"IF(COUNTIF(Award!$E$20:$E$83,U2)>=1,\"\",ROW())","v":2},{"$f":"IF(ROW(U2)-ROW(U$2)+1>COUNT(V$2:V$50),\"\",INDEX(U:U,SMALL(V$2:V$50,1+ROW(U2)-ROW(U$2))))","v":"Digital Moving Image Production"},null,"Health and Safety in Engineering",{"$f":"IF(COUNTIF(Award!$E$20:$E$83,Y2)>=1,\"\",ROW())","v":2},{"$f":"IF(ROW(Y2)-ROW(Y$2)+1>COUNT(Z$2:Z$50),\"\",INDEX(Y:Y,SMALL(Z$2:Z$50,1+ROW(Y2)-ROW(Y$2))))","v":"Health and Safety in Engineering"},null,"Horse Handling",{"$f":"IF(COUNTIF(Award!$E$20:$E$83,AC2)>=1,\"\",ROW())","v":2},{"$f":"IF(ROW(AC2)-ROW(AC$2)+1>COUNT(AD$2:AD$50),\"\",INDEX(AC:AC,SMALL(AD$2:AD$50,1+ROW(AC2)-ROW(AC$2))))","v":"Horse Handling"},null,"Effective Communication in Health and Social Care",{"$f":"IF(COUNTIF(Award!$E$20:$E$83,AG2)>=1,\"\",ROW())","v":2},{"$f":"IF(ROW(AG2)-ROW(AG$2)+1>COUNT(AH$2:AH$50),\"\",INDEX(AG:AG,SMALL(AH$2:AH$50,1+ROW(AG2)-ROW(AG$2))))","v":"Effective Communication in Health and Social Care"},null,"Costing and Controlling Finances in the Hospitality Industry",{"$f":"IF(COUNTIF(Award!$E$20:$E$83,AK2)>=1,\"\",ROW())","v":2},{"$f":"IF(ROW(AK2)-ROW(AK$2)+1>COUNT(AL$2:AL$50),\"\",INDEX(AK:AK,SMALL(AL$2:AL$50,1+ROW(AK2)-ROW(AK$2))))","v":"Costing and Controlling Finances in the Hospitality Industry"},null,"Creating Digital Animation",{"$f":"IF(COUNTIF(Award!$E$20:$E$83,AO2)>=1,\"\",ROW())","v":2},{"$f":"IF(ROW(AO2)-ROW(AO$2)+1>COUNT(AP$2:AP$50),\"\",INDEX(AO:AO,SMALL(AP$2:AP$50,1+ROW(AO2)-ROW(AO$2))))","v":"Creating Digital Animation"},null,"Introducing Live Sound",{"$f":"IF(COUNTIF(Award!$E$20:$E$83,AS2)>=1,\"\",ROW())","v":2},{"$f":"IF(ROW(AS2)-ROW(AS$2)+1>COUNT(AT$2:AT$50),\"\",INDEX(AS:AS,SMALL(AT$2:AT$50,1+ROW(AS2)-ROW(AS$2))))","v":"Introducing Live Sound"},null,"Acting Skills",{"$f":"IF(COUNTIF(Award!$E$20:$E$83,AW2)>=1,\"\",ROW())","v":2},{"$f":"IF(ROW(AW2)-ROW(AW$2)+1>COUNT(AX$2:AX$50),\"\",INDEX(AW:AW,SMALL(AX$2:AX$50,1+ROW(AW2)-ROW(AW$2))))","v":"Acting Skills"},null,"Employment in the Public Services",{"$f":"IF(COUNTIF(Award!$E$20:$E$83,BA2)>=1,\"\",ROW())","v":2},{"$f":"IF(ROW(BA2)-ROW(BA$2)+1>COUNT(BB$2:BB$50),\"\",INDEX(BA:BA,SMALL(BB$2:BB$50,1+ROW(BA2)-ROW(BA$2))))","v":"Employment in the Public Services"},null,"The Mind and Sports Performance",{"$f":"IF(COUNTIF(Award!$E$20:$E$83,BE2)>=1,\"\",ROW())","v":2},{"$f":"IF(ROW(BE2)-ROW(BE$2)+1>COUNT(BF$2:BF$50),\"\",INDEX(BE:BE,SMALL(BF$2:BF$50,1+ROW(BE2)-ROW(BE$2))))","v":"The Mind and Sports Performance"},null,"The Mind and Sports Performance",{"$f":"IF(COUNTIF(Award!$E$20:$E$83,BI2)>=1,\"\",ROW())","v":2},{"$f":"IF(ROW(BI2)-ROW(BI$2)+1>COUNT(BJ$2:BJ$50),\"\",INDEX(BI:BI,SMALL(BJ$2:BJ$50,1+ROW(BI2)-ROW(BI$2))))","v":"The Mind and Sports Performance"},null,"The Development of Travel and Tourism in the UK",{"$f":"IF(COUNTIF(Award!$E$20:$E$83,BM2)>=1,\"\",ROW())","v":2},{"$f":"IF(ROW(BM2)-ROW(BM$2)+1>COUNT(BN$2:BN$50),\"\",INDEX(BM:BM,SMALL(BN$2:BN$50,1+ROW(BM2)-ROW(BM$2))))","v":"The Development of Travel and Tourism in the UK"},null,"International Travel and Tourism Destinations",{"$f":"IF(COUNTIF(Award!$E$20:$E$83,BQ2)>=1,\"\",ROW())","v":2},{"$f":"IF(ROW(BQ2)-ROW(BQ$2)+1>COUNT(BR$2:BR$50),\"\",INDEX(BQ:BQ,SMALL(BR$2:BR$50,1+ROW(BQ2)-ROW(BQ$2))))","v":"International Travel and Tourism Destinations"}]
["Communicating Ideas in 3D",{"$f":"IF(COUNTIF(Award!$E$20:$E$83,A3)>=1,\"\",ROW())","v":3},{"$f":"IF(ROW(A3)-ROW(A$2)+1>COUNT(B$2:B$50),\"\",INDEX(A:A,SMALL(B$2:B$50,1+ROW(A3)-ROW(A$2))))","v":"Communicating Ideas in 3D"},null,"Principles of Customer Services",{"$f":"IF(COUNTIF(Award!$E$20:$E$83,E3)>=1,\"\",ROW())","v":3},{"$f":"IF(ROW(E3)-ROW(E$2)+1>COUNT(F$2:F$50),\"\",INDEX(E:E,SMALL(F$2:F$50,1+ROW(E3)-ROW(E$2))))","v":"Principles of Customer Services"},null,"Principles of Customer Services",{"$f":"IF(COUNTIF(Award!$E$20:$E$83,I3)>=1,\"\",ROW())","v":3},{"$f":"IF(ROW(I3)-ROW(I$2)+1>COUNT(J$2:J$50),\"\",INDEX(I:I,SMALL(J$2:J$50,1+ROW(I3)-ROW(I$2))))","v":"Principles of Customer Services"},null,"Construction Drawing Techniques",{"$f":"IF(COUNTIF(Award!$E$20:$E$83,M3)>=1,\"\",ROW())","v":3},{"$f":"IF(ROW(M3)-ROW(M$2)+1>COUNT(N$2:N$50),\"\",INDEX(M:M,SMALL(N$2:N$50,1+ROW(M3)-ROW(M$2))))","v":"Construction Drawing Techniques"},null,"Exploring Carpentry and Joinery Principles and Techniques",{"$f":"IF(COUNTIF(Award!$E$20:$E$83,Q3)>=1,\"\",ROW())","v":3},{"$f":"IF(ROW(Q3)-ROW(Q$2)+1>COUNT(R$2:R$50),\"\",INDEX(Q:Q,SMALL(R$2:R$50,1+ROW(Q3)-ROW(Q$2))))","v":"Exploring Carpentry and Joinery Principles and Techniques"},null,"Digital Audio Production",{"$f":"IF(COUNTIF(Award!$E$20:$E$83,U3)>=1,\"\",ROW())","v":3},{"$f":"IF(ROW(U3)-ROW(U$2)+1>COUNT(V$2:V$50),\"\",INDEX(U:U,SMALL(V$2:V$50,1+ROW(U3)-ROW(U$2))))","v":"Digital Audio Production"},null,"Engineering Maintenance",{"$f":"IF(COUNTIF(Award!$E$20:$E$83,Y3)>=1,\"\",ROW())","v":3},{"$f":"IF(ROW(Y3)-ROW(Y$2)+1>COUNT(Z$2:Z$50),\"\",INDEX(Y:Y,SMALL(Z$2:Z$50,1+ROW(Y3)-ROW(Y$2))))","v":"Engineering Maintenance"},null,"Equine Behaviour",{"$f":"IF(COUNTIF(Award!$E$20:$E$83,AC3)>=1,\"\",ROW())","v":3},{"$f":"IF(ROW(AC3)-ROW(AC$2)+1>COUNT(AD$2:AD$50),\"\",INDEX(AC:AC,SMALL(AD$2:AD$50,1+ROW(AC3)-ROW(AC$2))))","v":"Equine Behaviour"},null,"Social Influences on Health and Wellbeing",{"$f":"IF(COUNTIF(Award!$E$20:$E$83,AG3)>=1,\"\",ROW())","v":3},{"$f":"IF(ROW(AG3)-ROW(AG$2)+1>COUNT(AH$2:AH$50),\"\",INDEX(AG:AG,SMALL(AH$2:AH$50,1+ROW(AG3)-ROW(AG$2))))","v":"Social Influences on Health and Wellbeing"},null,"Enterprise in the Hospitality Industry",{"$f":"IF(COUNTIF(Award!$E$20:$E$83,AK3)>=1,\"\",ROW())","v":3},{"$f":"IF(ROW(AK3)-ROW(AK$2)+1>COUNT(AL$2:AL$50),\"\",INDEX(AK:AK,SMALL(AL$2:AL$50,1+ROW(AK3)-ROW(AK$2))))","v":"Enterprise in the Hospitality Industry"},null,"Creating Digital Audio",{"$f":"IF(COUNTIF(Award!$E$20:$E$83,AO3)>=1,\"\",ROW())","v":3},{"$f":"IF(ROW(AO3)-ROW(AO$2)+1>COUNT(AP$2:AP$50),\"\",INDEX(AO:AO,SMALL(AP$2:AP$50,1+ROW(AO3)-ROW(AO$2))))","v":"Creating Digital Audio"},null,"Introducing Music Composition",{"$f":"IF(COUNTIF(Award!$E$20:$E$83,AS3)>=1,\"\",ROW())","v":3},{"$f":"IF(ROW(AS3)-ROW(AS$2)+1>COUNT(AT$2:AT$50),\"\",INDEX(AS:AS,SMALL(AT$2:AT$50,1+ROW(AS3)-ROW(AS$2))))","v":"Introducing Music Composition"},null,"Dance Skills",{"$f":"IF(COUNTIF(Award!$E$20:$E$83,AW3)>=1,\"\",ROW())","v":3},{"$f":"IF(ROW(AW3)-ROW(AW$2)+1>COUNT(AX$2:AX$50),\"\",INDEX(AW:AW,SMALL(AX$2:AX$50,1+ROW(AW3)-ROW(AW$2))))","v":"Dance Skills"},null,"Public Services and Community Protection",{"$f":"IF(COUNTIF(Award!$E$20:$E$83,BA3)>=1,\"\",ROW())","v":3},{"$f":"IF(ROW(BA3)-ROW(BA$2)+1>COUNT(BB$2:BB$50),\"\",INDEX(BA:BA,SMALL(BB$2:BB$50,1+ROW(BA3)-ROW(BA$2))))","v":"Public Services and Community Protection"},null,"The Sports Performer in Action",{"$f":"IF(COUNTIF(Award!$E$20:$E$83,BE3)>=1,\"\",ROW())","v":3},{"$f":"IF(ROW(BE3)-ROW(BE$2)+1>COUNT(BF$2:BF$50),\"\",INDEX(BE:BE,SMALL(BF$2:BF$50,1+ROW(BE3)-ROW(BE$2))))","v":"The Sports Performer in Action"},null,"The Sports Performer in Action",{"$f":"IF(COUNTIF(Award!$E$20:$E$83,BI3)>=1,\"\",ROW())","v":3},{"$f":"IF(ROW(BI3)-ROW(BI$2)+1>COUNT(BJ$2:BJ$50),\"\",INDEX(BI:BI,SMALL(BJ$2:BJ$50,1+ROW(BI3)-ROW(BI$2))))","v":"The Sports Performer in Action"},null,"International Travel and Tourism Destinations",{"$f":"IF(COUNTIF(Award!$E$20:$E$83,BM3)>=1,\"\",ROW())","v":3},{"$f":"IF(ROW(BM3)-ROW(BM$2)+1>COUNT(BN$2:BN$50),\"\",INDEX(BM:BM,SMALL(BN$2:BN$50,1+ROW(BM3)-ROW(BM$2))))","v":"International Travel and Tourism Destinations"},null,"Factors Affecting Worldwide Travel and Tourism",{"$f":"IF(COUNTIF(Award!$E$20:$E$83,BQ3)>=1,\"\",ROW())","v":3},{"$f":"IF(ROW(BQ3)-ROW(BQ$2)+1>COUNT(BR$2:BR$50),\"\",INDEX(BQ:BQ,SMALL(BR$2:BR$50,1+ROW(BQ3)-ROW(BQ$2))))","v":"Factors Affecting Worldwide Travel and Tourism"}]
["Developing an Art and Design Portfolio",{"$f":"IF(COUNTIF(Award!$E$20:$E$83,A4)>=1,\"\",ROW())","v":4},"Developing an Art and Design Portfolio",null,"Sales and Personal Selling",{"$f":"IF(COUNTIF(Award!$E$20:$E$83,E4)>=1,\"\",ROW())","v":4},"Sales and Personal Selling",null,"Recruitment, Selection and Employment",{"$f":"IF(COUNTIF(Award!$E$20:$E$83,I4)>=1,\"\",ROW())","v":4},"Recruitment, Selection and Employment",null,"Exploring Carpentry and Joinery Principles and Techniques",{"$f":"IF(COUNTIF(Award!$E$20:$E$83,M4)>=1,\"\",ROW())","v":4},"Exploring Carpentry and Joinery Principles and Techniques",null,"Exploring Brickwork and Blockwork Principles and Techniques",{"$f":"IF(COUNTIF(Award!$E$20:$E$83,Q4)>=1,\"\",ROW())","v":4},"Exploring Brickwork and Blockwork Principles and Techniques",null,"Digital Publishing Production",{"$f":"IF(COUNTIF(Award!$E$20:$E$83,U4)>=1,\"\",ROW())","v":4},"Digital Publishing Production",null,"Engineering Materials",{"$f":"IF(COUNTIF(Award!$E$20:$E$83,Y4)>=1,\"\",ROW())","v":4},"Engineering Materials",null,"Equine Tack, Equipment and Clothing",{"$f":"IF(COUNTIF(Award!$E$20:$E$83,AC4)>=1,\"\",ROW())","v":4},"Equine Tack, Equipment and Clothing",null,"Promoting Health and Wellbeing",{"$f":"IF(COUNTIF(Award!$E$20:$E$83,AG4)>=1,\"\",ROW())","v":4},"Promoting Health and Wellbeing",null,"Planning, Preparing, Cooking and Finishing Food",{"$f":"IF(COUNTIF(Award!$E$20:$E$83,AK4)>=1,\"\",ROW())","v":4},"Planning, Preparing, Cooking and Finishing Food",null,"Creating Digital Graphics",{"$f":"IF(COUNTIF(Award!$E$20:$E$83,AO4)>=1,\"\",ROW())","v":4},"Creating Digital Graphics",null,"Introducing Music Performance",{"$f":"IF(COUNTIF(Award!$E$20:$E$83,AS4)>=1,\"\",ROW())","v":4},"Introducing Music Performance",null,"Musical Theatre Skills",{"$f":"IF(COUNTIF(Award!$E$20:$E$83,AW4)>=1,\"\",ROW())","v":4},"Musical Theatre Skills",null,"Health, Fitness and Lifestyle for the Public Services",{"$f":"IF(COUNTIF(Award!$E$20:$E$83,BA4)>=1,\"\",ROW())","v":4},"Health, Fitness and Lifestyle for the Public Services",null,"Training for Personal Fitness",{"$f":"IF(COUNTIF(Award!$E$20:$E$83,BE4)>=1,\"\",ROW())","v":4},"Training for Personal Fitness",null,"Leading Sports Activities",{"$f":"IF(COUNTIF(Award!$E$20:$E$83,BI4)>=1,\"\",ROW())","v":4},"Leading Sports Activities",null,"Factors Affecting Worldwide Travel and Tourism",{"$f":"IF(COUNTIF(Award!$E$20:$E$83,BM4)>=1,\"\",ROW())","v":4},"Factors Affecting Worldwide Travel and Tourism"]
["Investigating Contextual References in Art and Design",{"$f":"IF(COUNTIF(Award!$E$20:$E$83,A5)>=1,\"\",ROW())","v":5},"Investigating Contextual References in Art and Design",null,"Introducing Retail Business",{"$f":"IF(COUNTIF(Award!$E$20:$E$83,E5)>=1,\"\",ROW())","v":5},"Introducing Retail Business",null,null,null,null,null,"Exploring Brickwork and Blockwork Principles and Techniques",{"$f":"IF(COUNTIF(Award!$E$20:$E$83,M5)>=1,\"\",ROW())","v":5},"Exploring Brickwork and Blockwork Principles and Techniques",null,"Exploring Painting and Decorating Principles and Techniques",{"$f":"IF(COUNTIF(Award!$E$20:$E$83,Q5)>=1,\"\",ROW())","v":5},"Exploring Painting and Decorating Principles and Techniques",null,"Website Production",{"$f":"IF(COUNTIF(Award!$E$20:$E$83,U5)>=1,\"\",ROW())","v":5},"Website Production",null,"Computer-aided Engineering",{"$f":"IF(COUNTIF(Award!$E$20:$E$83,Y5)>=1,\"\",ROW())","v":5},"Computer-aided Engineering",null,null,null,null,null,"The Impact of Nutrition on Health and Wellbeing",{"$f":"IF(COUNTIF(Award!$E$20:$E$83,AG5)>=1,\"\",ROW())","v":5},"The Impact of Nutrition on Health and Wellbeing",null,"Food and Beverage Service in the Hospitality Industry",{"$f":"IF(COUNTIF(Award!$E$20:$E$83,AK5)>=1,\"\",ROW())","v":5},"Food and Beverage Service in the Hospitality Industry",null,"Creating Digital Video",{"$f":"IF(COUNTIF(Award!$E$20:$E$83,AO5)>=1,\"\",ROW())","v":5},"Creating Digital Video",null,"Introducing Music Recording",{"$f":"IF(COUNTIF(Award!$E$20:$E$83,AS5)>=1,\"\",ROW())","v":5},"Introducing Music Recording",null,"Music Performance Skills",{"$f":"IF(COUNTIF(Award!$E$20:$E$83,AW5)>=1,\"\",ROW())","v":5},"Music Performance Skills",null,null,null,null,null,"Leading Sports Activities",{"$f":"IF(COUNTIF(Award!$E$20:$E$83,BE5)>=1,\"\",ROW())","v":5},"Leading Sports Activities",null,null,null,null,null,"The Travel and Tourism Customer Experience",{"$f":"IF(COUNTIF(Award!$E$20:$E$83,BM5)>=1,\"\",ROW())","v":5},"The Travel and Tourism Customer Experience"]
[null,null,null,null,"Providing Business Support",{"$f":"IF(COUNTIF(Award!$E$20:$E$83,E6)>=1,\"\",ROW())","v":6},"Providing Business Support",null,null,null,null,null,"Exploring Painting and Decorating Principles and Techniques",{"$f":"IF(COUNTIF(Award!$E$20:$E$83,M6)>=1,\"\",ROW())","v":6},"Exploring Painting and Decorating Principles and Techniques",null,"Exploring Plumbing Principles and Techniques",{"$f":"IF(COUNTIF(Award!$E$20:$E$83,Q6)>=1,\"\",ROW())","v":6},"Exploring Plumbing Principles and Techniques",null,"Digital Games Production",{"$f":"IF(COUNTIF(Award!$E$20:$E$83,U6)>=1,\"\",ROW())","v":6},"Digital Games Production",null,"Machining Techniques",{"$f":"IF(COUNTIF(Award!$E$20:$E$83,Y6)>=1,\"\",ROW())","v":6},"Machining Techniques",null,null,null,null,null,"Equality and Diversity in Health and Social Care",{"$f":"IF(COUNTIF(Award!$E$20:$E$83,AG6)>=1,\"\",ROW())","v":6},"Equality and Diversity in Health and Social Care",null,"Front Office Services in the Hospitality Industry",{"$f":"IF(COUNTIF(Award!$E$20:$E$83,AK6)>=1,\"\",ROW())","v":6},"Front Office Services in the Hospitality Industry",null,"Spreadsheet Development",{"$f":"IF(COUNTIF(Award!$E$20:$E$83,AO6)>=1,\"\",ROW())","v":6},"Spreadsheet Development",null,"Introducing Music Sequencing",{"$f":"IF(COUNTIF(Award!$E$20:$E$83,AS6)>=1,\"\",ROW())","v":6},"Introducing Music Sequencing",null,"Production Skills for Performance",{"$f":"IF(COUNTIF(Award!$E$20:$E$83,AW6)>=1,\"\",ROW())","v":6},"Production Skills for Performance"]
[null,null,null,null,"Recruitment, Selection and Employment",{"$f":"IF(COUNTIF(Award!$E$20:$E$83,E7)>=1,\"\",ROW())","v":7},"Recruitment, Selection and Employment",null,null,null,null,null,"Exploring Plumbing Principles and Techniques",{"$f":"IF(COUNTIF(Award!$E$20:$E$83,M7)>=1,\"\",ROW())","v":7},"Exploring Plumbing Principles and Techniques",null,"Exploring Electrical Principles and Techniques",{"$f":"IF(COUNTIF(Award!$E$20:$E$83,Q7)>=1,\"\",ROW())","v":7},"Exploring Electrical Principles and Techniques",null,null,null,null,null,"Electronic Circuit Design and Construction",{"$f":"IF(COUNTIF(Award!$E$20:$E$83,Y7)>=1,\"\",ROW())","v":7},"Electronic Circuit Design and Construction",null,null,null,null,null,"Individual Rights in Health and Social Care",{"$f":"IF(COUNTIF(Award!$E$20:$E$83,AG7)>=1,\"\",ROW())","v":7},"Individual Rights in Health and Social Care",null,null,null,null,null,"Database Development",{"$f":"IF(COUNTIF(Award!$E$20:$E$83,AO7)>=1,\"\",ROW())","v":7},"Database Development"]
[null,null,null,null,null,null,null,null,null,null,null,null,"Exploring Electrical Principles and Techniques",{"$f":"IF(COUNTIF(Award!$E$20:$E$83,M8)>=1,\"\",ROW())","v":8},"Exploring Electrical Principles and Techniques",null,null,null,null,null,null,null,null,null,null,null,null,null,null,null,null,null,null,null,null,null,null,null,null,null,"Website Development",{"$f":"IF(COUNTIF(Award!$E$20:$E$83,AO8)>=1,\"\",ROW())","v":8},"Website Development"]

{"sheet":"Cert Data Sheet","index":7,"n_rows":288,"n_cols":19,"rows_kept":288,"cut":false,"hidden":true,"merged":[]}
["Mandatory units",null,null,null,null,null,null,"optional Units A",null,null,null,null,null,null,"optional Units B"]
["Sector","Unit number","Unit Name","GLH","Assessment type",null,null,"Sector","Unit Number","Unit Name","GLH","Assessment type",null,null,"Sector","Unit Number","Unit Name","GLH","Assessment type"]
["Art and Design",1,"Introduction to Specialist Pathways in Art and Design",30,"Internal",null,"Communicating Ideas in 2D","Art and Design",3,"Communicating Ideas in 2D",30,"Internal",null,"Digital Editing for Moving Image","Creative Digital Media Production",9,"Digital Editing for Moving Image",60,"Internal"]
["Art and Design",2,"Creative Project in Art and Design",30,"External",null,"Communicating Ideas in 3D","Art and Design",4,"Communicating Ideas in 3D",30,"Internal",null,"Digital Photography for a Media Product","Creative Digital Media Production",10,"Digital Photography for a Media Product",60,"Internal"]
["Art and Design",6,"Investigating Contextual References in Art and Design",30,"Internal",null,"Developing an Art and Design Portfolio","Art and Design",5,"Developing an Art and Design Portfolio",30,"Internal",null,"Animation for Digital Media","Creative Digital Media Production",11,"Animation for Digital Media",60,"Internal"]
["Art and Design",7,"Recording for Creative Intentions in Art and Design",30,"External",null,"Using Mobile Devices in Art and Design","Art and Design",8,"Using Mobile Devices in Art and Design",30,"Internal",null,"Digital Audio Editing","Creative Digital Media Production",12,"Digital Audio Editing",30,"Internal"]
["Art and Design Design Crafts",1,"Introduction to Specialist Pathways in Art and Design",30,"Internal",null,"Design Crafts Briefs","Art and Design",9,"Design Crafts Briefs",60,"Internal",null,"Graphic Design for Digital Media","Creative Digital Media Production",13,"Graphic Design for Digital Media",30,"Internal"]
["Art and Design Design Crafts",2,"Creative Project in Art and Design",30,"External",null,"Fashion Briefs","Art and Design",10,"Fashion Briefs",60,"Internal",null,"Writing for Digital Media","Creative Digital Media Production",14,"Writing for Digital Media",30,"Internal"]
["Art and Design Design Crafts",6,"Investigating Contextual References in Art and Design",30,"Internal",null,"Graphic Design Briefs","Art and Design",11,"Graphic Design Briefs",60,"Internal",null,"Digital Games Testing","Creative Digital Media Production",15,"Digital Games Testing",30,"Internal"]
["Art and Design Design Crafts",7,"Recording for Creative Intentions in Art and Design",30,"External",null,"Textiles Briefs","Art and Design",12,"Textiles Briefs",60,"Internal",null,"Contemporary Dance Techniques","Performing Arts Acting",16,"Contemporary Dance Techniques",30,"Internal"]
["Art and Design Design Crafts",9,"Design Crafts Briefs",60,"Internal",null,"Visual Arts Briefs","Art and Design",13,"Visual Arts Briefs",60,"Internal",null,"Exploring Urban Dance Styles","Performing Arts Acting",17,"Exploring Urban Dance Styles",30,"Internal"]
["Art and Design Fashion and Textiles",1,"Introduction to Specialist Pathways in Art and Design",30,"Internal",null,"Photography Briefs","Art and Design",14,"Photography Briefs",60,"Internal",null,"Jazz Dance Techniques","Performing Arts Acting",18,"Jazz Dance Techniques",30,"Internal"]
["Art and Design Fashion and Textiles",2,"Creative Project in Art and Design",30,"External",null,"Designing for the Future","Art and Design",15,"Designing for the Future",60,"Internal",null,"Design Planning for Performance","Performing Arts Acting",19,"Design Planning for Performance",30,"Internal"]
["Art and Design Fashion and Textiles",6,"Investigating Contextual References in Art and Design",30,"Internal",null,"Communicating Ideas in 2D","Art and Design Design Crafts",3,"Communicating Ideas in 2D",30,"Internal",null,"Realising Costume Design for Performance","Performing Arts Acting",20,"Realising Costume Design for Performance",30,"Internal"]
["Art and Design Fashion and Textiles",7,"Recording for Creative Intentions in Art and Design",30,"External",null,"Developing an Art and Design Portfolio","Art and Design Design Crafts",5,"Developing an Art and Design Portfolio",30,"Internal",null,"Realising Set Design for Performance","Performing Arts Acting",21,"Realising Set Design for Performance",30,"Internal"]
["Art and Design Fashion and Textiles",10,"Fashion Briefs",60,"Internal",null,"Fashion Briefs","Art and Design Design Crafts",10,"Fashion Briefs",60,"Internal",null,"Realising Prop Design for Performance","Performing Arts Acting",22,"Realising Prop Design for Performance",30,"Internal"]
["Art and Design Fashion and Textiles",12,"Textiles Briefs",60,"Internal",null,"Textiles Briefs","Art and Design Design Crafts",12,"Textiles Briefs",60,"Internal",null,"Realising Mask Design for Performance","Performing Arts Acting",23,"Realising Mask Design for Performance",30,"Internal"]
["Art and Design Photography",1,"Introduction to Specialist Pathways in Art and Design",30,"Internal",null,"Designing for the Future","Art and Design Design Crafts",15,"Designing for the Future",60,"Internal",null,"Lighting for Performance","Performing Arts Acting",24,"Lighting for Performance",30,"Internal"]
["Art and Design Photography",2,"Creative Project in Art and Design",30,"External",null,"Communicating Ideas in 2D","Art and Design Photography",3,"Communicating Ideas in 2D",30,"Internal",null,"Sound for Performance","Performing Arts Acting",25,"Sound for Performance",30,"Internal"]
["Art and Design Photography",6,"Investigating Contextual References in Art and Design",30,"Internal",null,"Communicating Ideas in 3D","Art and Design Photography",4,"Communicating Ideas in 3D",30,"Internal",null,"Make-up for Performance","Performing Arts Acting",28,"Make-up for Performance",30,"Internal"]
["Art and Design Photography",7,"Recording for Creative Intentions in Art and Design",30,"External",null,"Developing an Art and Design Portfolio","Art and Design Photography",5,"Developing an Art and Design Portfolio",30,"Internal",null,"Wardrobe for Stage Performance","Performing Arts Acting",29,"Wardrobe for Stage Performance",30,"Internal"]
["Art and Design Photography",14,"Photography Briefs",60,"Internal",null,"Using Mobile Devices in Art and Design","Art and Design Photography",8,"Using Mobile Devices in Art and Design",30,"Internal",null,"Use of ICT in the Performing Arts","Performing Arts Acting",38,"Use of ICT in the Performing Arts",30,"Internal"]
["Art and Design Product Design",1,"Introduction to Specialist Pathways in Art and Design",30,"Internal",null,"Fashion Briefs","Art and Design Photography",10,"Fashion Briefs",60,"Internal",null,"Work Experience in the Performing Arts","Performing Arts Acting",39,"Work Experience in the Performing Arts",30,"Internal"]
["Art and Design Product Design",2,"Creative Project in Art and Design",30,"External",null,"Designing for the Future","Art and Design Photography",15,"Designing for the Future",60,"Internal",null,"Voice and Speech for Performers","Performing Arts Dance",14,"Voice and Speech for Performers",30,"Internal"]
["Art and Design Product Design",6,"Investigating Contextual References in Art and Design",30,"Internal",null,"Studio Photography","Art and Design Photography",31,"Studio Photography",60,"Internal",null,"Performing Scripted Plays","Performing Arts Dance",15,"Performing Scripted Plays",30,"Internal"]
["Art and Design Product Design",7,"Recording for Creative Intentions in Art and Design",30,"External",null,"Location Photography","Art and Design Photography",32,"Location Photography",60,"Internal",null,"Design Planning for Performance","Performing Arts Dance",19,"Design Planning for Performance",30,"Internal"]
["Art and Design Product Design",15,"Designing for the Future",60,"Internal",null,"Editing Photographic Images","Art and Design Photography",34,"Editing Photographic Images",60,"Internal",null,"Realising Costume Design for Performance","Performing Arts Dance",20,"Realising Costume Design for Performance",30,"Internal"]
["Art and Design Visual Arts",1,"Introduction to Specialist Pathways in Art and Design",30,"Internal",null,"Communicating Ideas in 2D","Art and Design Product Design",3,"Communicating Ideas in 2D",30,"Internal",null,"Realising Set Design for Performance","Performing Arts Dance",21,"Realising Set Design for Performance",30,"Internal"]
["Art and Design Visual Arts",2,"Creative Project in Art and Design",30,"External",null,"Communicating Ideas in 3D","Art and Design Product Design",4,"Communicating Ideas in 3D",30,"Internal",null,"Realising Prop Design for Performance","Performing Arts Dance",22,"Realising Prop Design for Performance",30,"Internal"]
["Art and Design Visual Arts",6,"Investigating Contextual References in Art and Design",30,"Internal",null,"Developing an Art and Design Portfolio","Art and Design Product Design",5,"Developing an Art and Design Portfolio",30,"Internal",null,"Realising Mask Design for Performance","Performing Arts Dance",23,"Realising Mask Design for Performance",30,"Internal"]
["Art and Design Visual Arts",7,"Recording for Creative Intentions in Art and Design",30,"External",null,"Using Mobile Devices in Art and Design","Art and Design Product Design",8,"Using Mobile Devices in Art and Design",30,"Internal",null,"Lighting for Performance","Performing Arts Dance",24,"Lighting for Performance",30,"Internal"]
["Art and Design Visual Arts",13,"Visual Arts Briefs",60,"Internal",null,"Fashion Briefs","Art and Design Product Design",10,"Fashion Briefs",60,"Internal",null,"Sound for Performance","Performing Arts Dance",25,"Sound for Performance",30,"Internal"]
["Art and Design Visual Communication",1,"Introduction to Specialist Pathways in Art and Design",30,"Internal",null,"Graphic Design Briefs","Art and Design Product Design",11,"Graphic Design Briefs",60,"Internal",null,"Make-up for Performance","Performing Arts Dance",28,"Make-up for Performance",30,"Internal"]
["Art and Design Visual Communication",2,"Creative Project in Art and Design",30,"External",null,"Textiles Briefs","Art and Design Product Design",12,"Textiles Briefs",60,"Internal",null,"Wardrobe for Stage Performance","Performing Arts Dance",29,"Wardrobe for Stage Performance",30,"Internal"]
["Art and Design Visual Communication",6,"Investigating Contextual References in Art and Design",30,"Internal",null,"Developing an Art and Design Portfolio","Art and Design Visual Arts",5,"Developing an Art and Design Portfolio",30,"Internal",null,"Use of ICT in the Performing Arts","Performing Arts Dance",38,"Use of ICT in the Performing Arts",30,"Internal"]
["Art and Design Visual Communication",7,"Recording for Creative Intentions in Art and Design",30,"External",null,"Using Mobile Devices in Art and Design","Art and Design Visual Arts",8,"Using Mobile Devices in Art and Design",30,"Internal",null,"Work Experience in the Performing Arts","Performing Arts Dance",39,"Work Experience in the Performing Arts",30,"Internal"]
["Art and Design Visual Communication",11,"Graphic Design Briefs",60,"Internal",null,"Design Crafts Briefs","Art and Design Visual Arts",9,"Design Crafts Briefs",60,"Internal",null,"Performing Scripted Plays","Performing Arts Musical Theatre",15,"Performing Scripted Plays",30,"Internal"]
["Business",1,"Enterprise in the Business World",30,"Internal",null,"Fashion Briefs","Art and Design Visual Arts",10,"Fashion Briefs",60,"Internal",null,"Contemporary Dance Techniques","Performing Arts Musical Theatre",16,"Contemporary Dance Techniques",30,"Internal"]
["Business",2,"Finance for Business",30,"External",null,"Graphic Design Briefs","Art and Design Visual Arts",11,"Graphic Design Briefs",60,"Internal",null,"Exploring Urban Dance Styles","Performing Arts Musical Theatre",17,"Exploring Urban Dance Styles",30,"Internal"]
["Business",9,"Principles of Marketing",30,"External",null,"Textiles Briefs","Art and Design Visual Arts",12,"Textiles Briefs",60,"Internal",null,"Jazz Dance Techniques","Performing Arts Musical Theatre",18,"Jazz Dance Techniques",30,"Internal"]
["Construction and the Built Environment",1,"Construction Technology",30,"External",null,"Photography Briefs","Art and Design Visual Arts",14,"Photography Briefs",60,"Internal",null,"Design Planning for Performance","Performing Arts Musical Theatre",19,"Design Planning for Performance",30,"Internal"]
["Construction and the Built Environment",2,"Construction and Design",30,"Internal",null,"Printmaking Briefs","Art and Design Visual Arts",28,"Printmaking Briefs",60,"Internal",null,"Realising Costume Design for Performance","Performing Arts Musical Theatre",20,"Realising Costume Design for Performance",30,"Internal"]
["Construction and the Built Environment",3,"Scientific and Mathematical Applications for Construction",30,"Internal",null,"Drawing from Observation","Art and Design Visual Arts",29,"Drawing from Observation",60,"Internal",null,"Realising Set Design for Performance","Performing Arts Musical Theatre",21,"Realising Set Design for Performance",30,"Internal"]
["Construction and the Built Environment",11,"Sustainability in Construction",30,"External",null,"Surface Design","Art and Design Visual Arts",36,"Surface Design",60,"Internal",null,"Realising Prop Design for Performance","Performing Arts Musical Theatre",22,"Realising Prop Design for Performance",30,"Internal"]
["Creative Digital Media Production",1,"Digital Media Sectors and Audiences",30,"External",null,"Sculpture","Art and Design Visual Arts",40,"Sculpture",60,"Internal",null,"Realising Mask Design for Performance","Performing Arts Musical Theatre",23,"Realising Mask Design for Performance",30,"Internal"]
["Creative Digital Media Production",2,"Planning and Pitching a Digital Media Product",30,"Internal",null,"Communicating Ideas in 3D","Art and Design Visual Communication",4,"Communicating Ideas in 3D",30,"Internal",null,"Lighting for Performance","Performing Arts Musical Theatre",24,"Lighting for Performance",30,"Internal"]
["Creative Digital Media Production",8,"Media Industry in Context",30,"External",null,"Developing an Art and Design Portfolio","Art and Design Visual Communication",5,"Developing an Art and Design Portfolio",30,"Internal",null,"Sound for Performance","Performing Arts Musical Theatre",25,"Sound for Performance",30,"Internal"]
["Engineering",1,"The Engineered World",30,"External",null,"Using Mobile Devices in Art and Design","Art and Design Visual Communication",8,"Using Mobile Devices in Art and Design",30,"Internal",null,"Make-up for Performance","Performing Arts Musical Theatre",28,"Make-up for Performance",30,"Internal"]
["Engineering",2,"Investigating an Engineered Product",30,"Internal",null,"Fashion Briefs","Art and Design Visual Communication",10,"Fashion Briefs",60,"Internal",null,"Wardrobe for Stage Performance","Performing Arts Musical Theatre",29,"Wardrobe for Stage Performance",30,"Internal"]
["Engineering",9,"Interpreting and Using Engineering Information",30,"External",null,"Visual Arts Briefs","Art and Design Visual Communication",13,"Visual Arts Briefs",60,"Internal",null,"Devising Performance Work","Performing Arts Production",11,"Devising Performance Work",30,"Internal"]
["Engineering",10,"Mathematics for Engineering",30,"Internal",null,"Photography Briefs","Art and Design Visual Communication",14,"Photography Briefs",60,"Internal",null,"Multimedia Performance","Performing Arts Production",13,"Multimedia Performance",30,"Internal"]
["Health and Social Care",1,"Human Lifespan Development",30,"External",null,"Designing for the Future","Art and Design Visual Communication",15,"Designing for the Future",60,"Internal",null,"Voice and Speech for Performers","Performing Arts Production",14,"Voice and Speech for Performers",30,"Internal"]
["Health and Social Care",2,"Health and Social Care Values",30,"Internal",null,"Applying Contextual References in Art and Design","Art and Design Visual Communication",16,"Applying Contextual References in Art and Design",30,"Internal",null,"Performing Scripted Plays","Performing Arts Production",15,"Performing Scripted Plays",30,"Internal"]
["Health and Social Care",3,"Effective Communication in Health and Social Care",30,"Internal",null,"Art, Craft and Design in the Creative Industries","Art and Design Visual Communication",17,"Art, Craft and Design in the Creative Industries",30,"Internal",null,"Contemporary Dance Techniques","Performing Arts Production",16,"Contemporary Dance Techniques",30,"Internal"]
["Health and Social Care",9,"Healthy Living",30,"External",null,"Digital Art and Design Briefs","Art and Design Visual Communication",19,"Digital Art and Design Briefs",60,"Internal",null,"Exploring Urban Dance Styles","Performing Arts Production",17,"Exploring Urban Dance Styles",30,"Internal"]
["Hospitality",1,"Introducing the Hospitality Industry",30,"External",null,"Interactive Media Production Briefs","Art and Design Visual Communication",20,"Interactive Media Production Briefs",60,"Internal",null,"Jazz Dance Techniques","Performing Arts Production",18,"Jazz Dance Techniques",30,"Internal"]
["Hospitality",2,"Working in the Hospitality Industry",30,"Internal",null,"Painting Briefs","Art and Design Visual Communication",21,"Painting Briefs",60,"Internal"]
["Hospitality",3,"Food Safety and Health and Safety in Hospitality",30,"Internal",null,"Practical Research Project in Art and Design","Art and Design Visual Communication",23,"Practical Research Project in Art and Design",60,"Internal"]
["Hospitality",9,"How the Hospitality Industry Contributes to Healthy Lifestyles",30,"External",null,"Moving Image Briefs","Art and Design Visual Communication",26,"Moving Image Briefs",60,"Internal"]
["Information and Creative Technology",1,"The Online World",30,"External",null,"Printmaking Briefs","Art and Design Visual Communication",28,"Printmaking Briefs",60,"Internal"]
["Information and Creative Technology",2,"Technology Systems",30,"External",null,"Drawing from Observation","Art and Design Visual Communication",29,"Drawing from Observation",60,"Internal"]
["Information and Creative Technology",3,"A Digital Portfolio",30,"Internal",null,"Ceramics","Art and Design Visual Communication",30,"Ceramics",60,"Internal"]
["Music",1,"The Music Industry",30,"External",null,"Sustainability in Art and Design Practice","Art and Design Visual Communication",37,"Sustainability in Art and Design Practice",30,"Internal"]
["Music",2,"Managing a Music Product",30,"Internal",null,"Modelmaking","Art and Design Visual Communication",39,"Modelmaking",60,"Internal"]
["Music",8,"Music and Production Analysis",30,"External",null,"Sculpture","Art and Design Visual Communication",40,"Sculpture",60,"Internal"]
["Performing Arts Acting",1,"Individual Showcase",30,"External",null,"Promoting a Brand","Business",3,"Promoting a Brand",30,"Internal"]
["Performing Arts Acting",2,"Preparation, Performance and Production",30,"Internal",null,"Principles of Customer Services","Business",4,"Principles of Customer Services",30,"Internal"]
["Performing Arts Acting",3,"Acting Skills",60,"Internal",null,"Sales and Personal Selling","Business",5,"Sales and Personal Selling",30,"Internal"]
["Performing Arts Acting",8,"The Performing Arts Industry",30,"External",null,"Introducing Retail Business","Business",6,"Introducing Retail Business",30,"Internal"]
["Performing Arts Dance",1,"Individual Showcase",30,"External",null,"Providing Business Support","Business",7,"Providing Business Support",30,"Internal"]
["Performing Arts Dance",2,"Preparation, Performance and Production",30,"Internal",null,"Recruitment, Selection and Employment","Business",8,"Recruitment, Selection and Employment",30,"Internal"]
["Performing Arts Dance",4,"Dance Skills",60,"Internal",null,"Using Business Documentation","Business",10,"Using Business Documentation",30,"Internal"]
["Performing Arts Dance",8,"The Performing Arts Industry",30,"External",null,"Building Successful Business Teams","Business",11,"Building Successful Business Teams",30,"Internal"]
["Performing Arts Musical Theatre",1,"Individual Showcase",30,"External",null,"Introducing Law and Consumer Rights","Business",12,"Introducing Law and Consumer Rights",30,"Internal"]
["Performing Arts Musical Theatre",2,"Preparation, Performance and Production",30,"Internal",null,"Financial Planning and Forecasting","Business",13,"Financial Planning and Forecasting",30,"Internal"]
["Performing Arts Musical Theatre",5,"Musical Theatre Skills",60,"Internal",null,"Business Online","Business",14,"Business Online",60,"Internal"]
["Performing Arts Musical Theatre",8,"The Performing Arts Industry",30,"External",null,"Public Sector Business","Business",15,"Public Sector Business",30,"Internal"]
["Performing Arts Production",1,"Individual Showcase",30,"External",null,"Enhancing the Customer Experience","Business",16,"Enhancing the Customer Experience",30,"Internal"]
["Performing Arts Production",2,"Preparation, Performance and Production",30,"Internal",null,"Visual Merchandising in Retail Business","Business",17,"Visual Merchandising in Retail Business",30,"Internal"]
["Performing Arts Production",7,"Production Skills for Performance",60,"Internal",null,"Small Business Planning","Business",18,"Small Business Planning",60,"Internal"]
["Performing Arts Production",8,"The Performing Arts Industry",30,"External",null,"Introducing Project Management","Business",19,"Introducing Project Management",60,"Internal"]
["Public Services",1,"The Role and Work of the Public Services",30,"External",null,"Delivering and Improving Customer Service","Business",20,"Delivering and Improving Customer Service",60,"Internal"]
["Public Services",2,"Working Skills in the Public Services Sector",30,"Internal",null,"Effective Business Communication","Business",21,"Effective Business Communication",60,"Internal"]
["Public Services",6,"Citizenship, Society and the Public Services",30,"External",null,"Working in Business Teams","Business",22,"Working in Business Teams",60,"Internal"]
["Sport",1,"Fitness for Sport and Exercise",30,"External",null,"Planning, Forecasting and Recording Business Finances","Business",23,"Planning, Forecasting and Recording Business Finances",60,"Internal"]
["Sport",2,"Practical Sports Performance",30,"Internal",null,"Work Experience in Business","Business",24,"Work Experience in Business",60,"Internal"]
["Sport",7,"Anatomy and Physiology for Sports Performance",30,"External",null,"Introducing International Business","Business",25,"Introducing International Business",60,"Internal"]
["Travel and Tourism",1,"The UK Travel and Tourism Sector",30,"External",null,"Introducing the Economic Environment","Business",26,"Introducing the Economic Environment",60,"Internal"]
["Travel and Tourism",2,"UK Travel and Tourism Destinations",30,"Internal",null,"Efficient Business Operations","Business",27,"Efficient Business Operations",60,"Internal"]
["Travel and Tourism",4,"International Travel and Tourism Destinations",30,"Internal",null,"Principles of Procurement and Supply","Business",28,"Principles of Procurement and Supply",60,"Internal"]
["Travel and Tourism",7,"Travel and Tourism Business Environments",30,"External",null,"Implementing Procurement and Supply in Business","Business",29,"Implementing Procurement and Supply in Business",60,"Internal"]
["CPLD",1,"Patterns of Child Development",30,"External",null,"Corporate Social Responsibility","Business",30,"Corporate Social Responsibility",30,"Internal"]
["CPLD",2,"Promoting Children’s Development Through Play",30,"Internal",null,"Managing Personal Finances","Business",31,"Managing Personal Finances",30,"Internal"]
["CPLD",3,"The Principles of Early Years Practice",60,"Internal",null,"Sustainability in the Business Workplace","Business",32,"Sustainability in the Business Workplace",30,"Internal"]
["CPLD",4,"Promoting Children’s Positive Behaviour",30,"External",null,"Construction Processes and Operations","Construction and the Built Environment",4,"Construction Processes and Operations",30,"Internal"]
[null,null,null,null,null,null,"Construction Drawing Techniques","Construction and the Built Environment",5,"Construction Drawing Techniques",30,"Internal"]
[null,null,null,null,null,null,"Exploring Carpentry and Joinery Principles and Techniques","Construction and the Built Environment",6,"Exploring Carpentry and Joinery Principles and Techniques",30,"Internal"]
[null,null,null,null,null,null,"Exploring Brickwork and Blockwork Principles and Techniques","Construction and the Built Environment",7,"Exploring Brickwork and Blockwork Principles and Techniques",30,"Internal"]
[null,null,null,null,null,null,"Exploring Painting and Decorating Principles and Techniques","Construction and the Built Environment",8,"Exploring Painting and Decorating Principles and Techniques",30,"Internal"]
[null,null,null,null,null,null,"Exploring Plumbing Principles and Techniques","Construction and the Built Environment",9,"Exploring Plumbing Principles and Techniques",30,"Internal"]
[null,null,null,null,null,null,"Exploring Electrical Principles and Techniques","Construction and the Built Environment",10,"Exploring Electrical Principles and Techniques",30,"Internal"]
[null,null,null,null,null,null,"Sustainability in Construction","Construction and the Built Environment",12,"Sustainability in Construction",30,"Internal"]
[null,null,null,null,null,null,"Exploring Roofing Principles and Techniques","Construction and the Built Environment",13,"Exploring Roofing Principles and Techniques",30,"Internal"]
[null,null,null,null,null,null,"Exploring Wall and Floor Tiling Principles and Techniques","Construction and the Built Environment",14,"Exploring Wall and Floor Tiling Principles and Techniques",30,"Internal"]
[null,null,null,null,null,null,"Exploring Plastering and Dry Lining Principles and Techniques","Construction and the Built Environment",15,"Exploring Plastering and Dry Lining Principles and Techniques",30,"Internal"]
[null,null,null,null,null,null,"Tendering and Estimating","Construction and the Built Environment",22,"Tendering and Estimating",60,"Internal"]
[null,null,null,null,null,null,"Exploring Surveying","Construction and the Built Environment",23,"Exploring Surveying",60,"Internal"]
[null,null,null,null,null,null,"Exploring Civil Engineering","Construction and the Built Environment",24,"Exploring Civil Engineering",60,"Internal"]
[null,null,null,null,null,null,"Exploring Building Services Engineering","Construction and the Built Environment",25,"Exploring Building Services Engineering",60,"Internal"]
[null,null,null,null,null,null,"Exploring Facilities Management","Construction and the Built Environment",26,"Exploring Facilities Management",60,"Internal"]
[null,null,null,null,null,null,"Digital Moving Image Production","Creative Digital Media Production",3,"Digital Moving Image Production",30,"Internal"]
[null,null,null,null,null,null,"Digital Audio Production","Creative Digital Media Production",4,"Digital Audio Production",30,"Internal"]
[null,null,null,null,null,null,"Digital Publishing Production","Creative Digital Media Production",5,"Digital Publishing Production",30,"Internal"]
[null,null,null,null,null,null,"Website Production","Creative Digital Media Production",6,"Website Production",30,"Internal"]
[null,null,null,null,null,null,"Digital Games Production","Creative Digital Media Production",7,"Digital Games Production",30,"Internal"]
[null,null,null,null,null,null,"Health and Safety in Engineering","Engineering",3,"Health and Safety in Engineering",30,"Internal"]
[null,null,null,null,null,null,"Engineering Maintenance","Engineering",4,"Engineering Maintenance",30,"Internal"]
[null,null,null,null,null,null,"Engineering Materials","Engineering",5,"Engineering Materials",30,"Internal"]
[null,null,null,null,null,null,"Computer-aided Engineering","Engineering",6,"Computer-aided Engineering",30,"Internal"]
[null,null,null,null,null,null,"Machining Techniques","Engineering",7,"Machining Techniques",60,"Internal"]
[null,null,null,null,null,null,"Electronic Circuit Design and Construction","Engineering",8,"Electronic Circuit Design and Construction",60,"Internal"]
[null,null,null,null,null,null,"Electrical and Mechanical Science for Engineering","Engineering",11,"Electrical and Mechanical Science for Engineering",30,"Internal"]
[null,null,null,null,null,null,"Engineering Design","Engineering",12,"Engineering Design",60,"Internal"]
[null,null,null,null,null,null,"Engineering Assembly","Engineering",13,"Engineering Assembly",30,"Internal"]
[null,null,null,null,null,null,"Vehicle Engines and Other Systems","Engineering",14,"Vehicle Engines and Other Systems",30,"Internal"]
[null,null,null,null,null,null,"Social Influences on Health and Wellbeing","Health and Social Care",4,"Social Influences on Health and Wellbeing",30,"Internal"]
[null,null,null,null,null,null,"Promoting Health and Wellbeing","Health and Social Care",5,"Promoting Health and Wellbeing",30,"Internal"]
[null,null,null,null,null,null,"The Impact of Nutrition on Health and Wellbeing","Health and Social Care",6,"The Impact of Nutrition on Health and Wellbeing",30,"Internal"]
[null,null,null,null,null,null,"Equality and Diversity in Health and Social Care","Health and Social Care",7,"Equality and Diversity in Health and Social Care",30,"Internal"]
[null,null,null,null,null,null,"Individual Rights in Health and Social Care","Health and Social Care",8,"Individual Rights in Health and Social Care",30,"Internal"]
[null,null,null,null,null,null,"Human Body Systems and Care of Disorders","Health and Social Care",10,"Human Body Systems and Care of Disorders",60,"Internal"]
[null,null,null,null,null,null,"Services in Health and Social Care","Health and Social Care",11,"Services in Health and Social Care",30,"Internal"]
[null,null,null,null,null,null,"Creative and Therapeutic Activities in Health and Social Care","Health and Social Care",12,"Creative and Therapeutic Activities in Health and Social Care",60,"Internal"]
[null,null,null,null,null,null,"Costing and Controlling Finances in the Hospitality Industry","Hospitality",4,"Costing and Controlling Finances in the Hospitality Industry",30,"Internal"]
[null,null,null,null,null,null,"Enterprise in the Hospitality Industry","Hospitality",5,"Enterprise in the Hospitality Industry",30,"Internal"]
[null,null,null,null,null,null,"Planning, Preparing, Cooking and Finishing Food","Hospitality",6,"Planning, Preparing, Cooking and Finishing Food",30,"Internal"]
[null,null,null,null,null,null,"Food and Beverage Service in the Hospitality Industry","Hospitality",7,"Food and Beverage Service in the Hospitality Industry",30,"Internal"]
[null,null,null,null,null,null,"Front Office Services in the Hospitality Industry","Hospitality",8,"Front Office Services in the Hospitality Industry",30,"Internal"]
[null,null,null,null,null,null,"Marketing and Promotion in Hospitality","Hospitality",10,"Marketing and Promotion in Hospitality",30,"Internal"]
[null,null,null,null,null,null,"Accommodation Services in the Hospitality Industry","Hospitality",11,"Accommodation Services in the Hospitality Industry",30,"Internal"]
[null,null,null,null,null,null,"Planning and Running a Hospitality Event","Hospitality",12,"Planning and Running a Hospitality Event",60,"Internal"]
[null,null,null,null,null,null,"Contemporary World Food Cooking Skills","Hospitality",13,"Contemporary World Food Cooking Skills",60,"Internal"]
[null,null,null,null,null,null,"Teamwork in Hospitality","Hospitality",14,"Teamwork in Hospitality",60,"Internal"]
[null,null,null,null,null,null,"Menu Planning","Hospitality",15,"Menu Planning",60,"Internal"]
[null,null,null,null,null,null,"Managing Finance in Hospitality","Hospitality",16,"Managing Finance in Hospitality",60,"Internal"]
[null,null,null,null,null,null,"Alcohol Awareness in Hospitality","Hospitality",17,"Alcohol Awareness in Hospitality",30,"Internal"]
[null,null,null,null,null,null,"Delivering the Hospitality Customer Experience","Hospitality",18,"Delivering the Hospitality Customer Experience",30,"Internal"]
[null,null,null,null,null,null,"Work Experience in Hospitality","Hospitality",20,"Work Experience in Hospitality",60,"Internal"]
[null,null,null,null,null,null,"Barista Skills in Hospitality","Hospitality",23,"Barista Skills in Hospitality",30,"Internal"]
[null,null,null,null,null,null,"Creating Digital Animation","Information and Creative Technology",4,"Creating Digital Animation",30,"Internal"]
[null,null,null,null,null,null,"Creating Digital Audio","Information and Creative Technology",5,"Creating Digital Audio",30,"Internal"]
[null,null,null,null,null,null,"Creating Digital Graphics","Information and Creative Technology",6,"Creating Digital Graphics",30,"Internal"]
[null,null,null,null,null,null,"Creating Digital Video","Information and Creative Technology",7,"Creating Digital Video",30,"Internal"]
[null,null,null,null,null,null,"Mobile Apps Development","Information and Creative Technology",8,"Mobile Apps Development",30,"Internal"]
[null,null,null,null,null,null,"Spreadsheet Development","Information and Creative Technology",9,"Spreadsheet Development",30,"Internal"]
[null,null,null,null,null,null,"Database Development","Information and Creative Technology",10,"Database Development",60,"Internal"]
[null,null,null,null,null,null,"Computer Networks","Information and Creative Technology",11,"Computer Networks",60,"Internal"]
[null,null,null,null,null,null,"Software Development","Information and Creative Technology",12,"Software Development",60,"Internal"]
[null,null,null,null,null,null,"Website Development","Information and Creative Technology",13,"Website Development",60,"Internal"]
[null,null,null,null,null,null,"Installing and Maintaining Computer Hardware","Information and Creative Technology",14,"Installing and Maintaining Computer Hardware",60,"Internal"]
[null,null,null,null,null,null,"Installing and Maintaining Computer Software","Information and Creative Technology",15,"Installing and Maintaining Computer Software",60,"Internal"]
[null,null,null,null,null,null,"Automated Computer Systems","Information and Creative Technology",16,"Automated Computer Systems",60,"Internal"]
[null,null,null,null,null,null,"Multimedia Products Development","Information and Creative Technology",17,"Multimedia Products Development",60,"Internal"]
[null,null,null,null,null,null,"Computational Thinking","Information and Creative Technology",18,"Computational Thinking",30,"Internal"]
[null,null,null,null,null,null,"Computing in the Workplace","Information and Creative Technology",19,"Computing in the Workplace",60,"Internal"]
[null,null,null,null,null,null,"Building a Personal Computer","Information and Creative Technology",20,"Building a Personal Computer",30,"Internal"]
[null,null,null,null,null,null,"A Technology Business","Information and Creative Technology",21,"A Technology Business",60,"Internal"]
[null,null,null,null,null,null,"Computer Security in Practice","Information and Creative Technology",22,"Computer Security in Practice",60,"Internal"]
[null,null,null,null,null,null,"Computer Systems Support in Practice","Information and Creative Technology",23,"Computer Systems Support in Practice",60,"Internal"]
[null,null,null,null,null,null,"Software Systems Development","Information and Creative Technology",24,"Software Systems Development",60,"Internal"]
[null,null,null,null,null,null,"IT Work Experience","Information and Creative Technology",25,"IT Work Experience",30,"Internal"]
[null,null,null,null,null,null,"Introducing Live Sound","Music",3,"Introducing Live Sound",30,"Internal"]
[null,null,null,null,null,null,"Introducing Music Composition","Music",4,"Introducing Music Composition",30,"Internal"]
[null,null,null,null,null,null,"Introducing Music Performance","Music",5,"Introducing Music Performance",30,"Internal"]
[null,null,null,null,null,null,"Introducing Music Recording","Music",6,"Introducing Music Recording",30,"Internal"]
[null,null,null,null,null,null,"Introducing Music Sequencing","Music",7,"Introducing Music Sequencing",30,"Internal"]
[null,null,null,null,null,null,"Introducing Choral Studies","Music",9,"Introducing Choral Studies",30,"Internal"]
[null,null,null,null,null,null,"Introducing Music Theory","Music",10,"Introducing Music Theory",30,"Internal"]
[null,null,null,null,null,null,"Developing Solo Music Performance","Music",11,"Developing Solo Music Performance",60,"Internal"]
[null,null,null,null,null,null,"The Development of Music","Music",12,"The Development of Music",60,"Internal"]
[null,null,null,null,null,null,"Developing Music Composition","Music",13,"Developing Music Composition",60,"Internal"]
[null,null,null,null,null,null,"Producing a Music Recording","Music",14,"Producing a Music Recording",60,"Internal"]
[null,null,null,null,null,null,"Music Ensemble","Music",15,"Music Ensemble",60,"Internal"]
[null,null,null,null,null,null,"Music Showcase","Music",16,"Music Showcase",30,"Internal"]
[null,null,null,null,null,null,"Researching a Music Topic","Music",17,"Researching a Music Topic",60,"Internal"]
[null,null,null,null,null,null,"Developing Modern Music Production Skills","Music",18,"Developing Modern Music Production Skills",60,"Internal"]
[null,null,null,null,null,null,"Developing Music Theory","Music",19,"Developing Music Theory",60,"Internal"]
[null,null,null,null,null,null,"Music Fusion","Music",20,"Music Fusion",60,"Internal"]
[null,null,null,null,null,null,"Music Arrangement","Music",21,"Music Arrangement",60,"Internal"]
[null,null,null,null,null,null,"Exploring Music Improvisation","Music",22,"Exploring Music Improvisation",60,"Internal"]
[null,null,null,null,null,null,"Exploring DJing","Music",23,"Exploring DJing",60,"Internal"]
[null,null,null,null,null,null,"Music Promotion","Music",24,"Music Promotion",60,"Internal"]
[null,null,null,null,null,null,"Digital and Mobile Technology for Music","Music",25,"Digital and Mobile Technology for Music",60,"Internal"]
[null,null,null,null,null,null,"Composing for Visual Media","Music",26,"Composing for Visual Media",60,"Internal"]
[null,null,null,null,null,null,"Enterprise and Music","Music",27,"Enterprise and Music",60,"Internal"]
[null,null,null,null,null,null,"Professional Skills in Music","Music",28,"Professional Skills in Music",60,"Internal"]
[null,null,null,null,null,null,"Performance in Context","Performing Arts Acting",9,"Performance in Context",30,"Internal"]
[null,null,null,null,null,null,"Movement Skills","Performing Arts Acting",10,"Movement Skills",30,"Internal"]
[null,null,null,null,null,null,"Devising Performance Work","Performing Arts Acting",11,"Devising Performance Work",30,"Internal"]
[null,null,null,null,null,null,"Exploring Improvisation","Performing Arts Acting",12,"Exploring Improvisation",30,"Internal"]
[null,null,null,null,null,null,"Multimedia Performance","Performing Arts Acting",13,"Multimedia Performance",30,"Internal"]
[null,null,null,null,null,null,"Voice and Speech for Performers","Performing Arts Acting",14,"Voice and Speech for Performers",30,"Internal"]
[null,null,null,null,null,null,"Performing Scripted Plays","Performing Arts Acting",15,"Performing Scripted Plays",30,"Internal"]
[null,null,null,null,null,null,"Community Arts","Performing Arts Acting",31,"Community Arts",60,"Internal"]
[null,null,null,null,null,null,"Directing Performance","Performing Arts Acting",32,"Directing Performance",60,"Internal"]
[null,null,null,null,null,null,"Planning and Managing a Performing Arts Event","Performing Arts Acting",33,"Planning and Managing a Performing Arts Event",60,"Internal"]
[null,null,null,null,null,null,"Physical Theatre Performance","Performing Arts Acting",35,"Physical Theatre Performance",60,"Internal"]
[null,null,null,null,null,null,"Variety Performance","Performing Arts Acting",36,"Variety Performance",60,"Internal"]
[null,null,null,null,null,null,"Performing Arts Enterprise","Performing Arts Acting",37,"Performing Arts Enterprise",60,"Internal"]
[null,null,null,null,null,null,"Singing Skills in the Performing Arts","Performing Arts Acting",40,"Singing Skills in the Performing Arts",60,"Internal"]
[null,null,null,null,null,null,"Performance in Context","Performing Arts Dance",9,"Performance in Context",30,"Internal"]
[null,null,null,null,null,null,"Movement Skills","Performing Arts Dance",10,"Movement Skills",30,"Internal"]
[null,null,null,null,null,null,"Devising Performance Work","Performing Arts Dance",11,"Devising Performance Work",30,"Internal"]
[null,null,null,null,null,null,"Multimedia Performance","Performing Arts Dance",13,"Multimedia Performance",30,"Internal"]
[null,null,null,null,null,null,"Contemporary Dance Techniques","Performing Arts Dance",16,"Contemporary Dance Techniques",30,"Internal"]
[null,null,null,null,null,null,"Exploring Urban Dance Styles","Performing Arts Dance",17,"Exploring Urban Dance Styles",30,"Internal"]
[null,null,null,null,null,null,"Jazz Dance Techniques","Performing Arts Dance",18,"Jazz Dance Techniques",30,"Internal"]
[null,null,null,null,null,null,"Physical Theatre Performance","Performing Arts Dance",35,"Physical Theatre Performance",60,"Internal"]
[null,null,null,null,null,null,"Variety Performance","Performing Arts Dance",36,"Variety Performance",60,"Internal"]
[null,null,null,null,null,null,"Singing Skills in the Performing Arts","Performing Arts Dance",40,"Singing Skills in the Performing Arts",60,"Internal"]
[null,null,null,null,null,null,"Performance in Context","Performing Arts Musical Theatre",9,"Performance in Context",30,"Internal"]
[null,null,null,null,null,null,"Movement Skills","Performing Arts Musical Theatre",10,"Movement Skills",30,"Internal"]
[null,null,null,null,null,null,"Devising Performance Work","Performing Arts Musical Theatre",11,"Devising Performance Work",30,"Internal"]
[null,null,null,null,null,null,"Voice and Speech for Performers","Performing Arts Musical Theatre",14,"Voice and Speech for Performers",30,"Internal"]
[null,null,null,null,null,null,"Performance in Context","Performing Arts Production",9,"Performance in Context",30,"Internal"]
[null,null,null,null,null,null,"Design Planning for Performance","Performing Arts Production",19,"Design Planning for Performance",30,"Internal"]
[null,null,null,null,null,null,"Realising Costume Design for Performance","Performing Arts Production",20,"Realising Costume Design for Performance",30,"Internal"]
[null,null,null,null,null,null,"Realising Set Design for Performance","Performing Arts Production",21,"Realising Set Design for Performance",30,"Internal"]
[null,null,null,null,null,null,"Realising Prop Design for Performance","Performing Arts Production",22,"Realising Prop Design for Performance",30,"Internal"]
[null,null,null,null,null,null,"Realising Mask Design for Performance","Performing Arts Production",23,"Realising Mask Design for Performance",30,"Internal"]
[null,null,null,null,null,null,"Lighting for Performance","Performing Arts Production",24,"Lighting for Performance",30,"Internal"]
[null,null,null,null,null,null,"Sound for Performance","Performing Arts Production",25,"Sound for Performance",30,"Internal"]
[null,null,null,null,null,null,"Supporting Performance: Stage Management","Performing Arts Production",26,"Supporting Performance: Stage Management",30,"Internal"]
[null,null,null,null,null,null,"Supporting Performance: Front of House","Performing Arts Production",27,"Supporting Performance: Front of House",30,"Internal"]
[null,null,null,null,null,null,"Make-up for Performance","Performing Arts Production",28,"Make-up for Performance",30,"Internal"]
[null,null,null,null,null,null,"Wardrobe for Stage Performance","Performing Arts Production",29,"Wardrobe for Stage Performance",30,"Internal"]
[null,null,null,null,null,null,"Community Arts","Performing Arts Production",31,"Community Arts",60,"Internal"]
[null,null,null,null,null,null,"Planning and Managing a Performing Arts Event","Performing Arts Production",33,"Planning and Managing a Performing Arts Event",60,"Internal"]
[null,null,null,null,null,null,"Multimedia Production","Performing Arts Production",34,"Multimedia Production",60,"Internal"]
[null,null,null,null,null,null,"Performing Arts Enterprise","Performing Arts Production",37,"Performing Arts Enterprise",60,"Internal"]
[null,null,null,null,null,null,"Use of ICT in the Performing Arts","Performing Arts Production",38,"Use of ICT in the Performing Arts",30,"Internal"]
[null,null,null,null,null,null,"Work Experience in the Performing Arts","Performing Arts Production",39,"Work Experience in the Performing Arts",30,"Internal"]
[null,null,null,null,null,null,"Employment in the Public Services","Public Services",3,"Employment in the Public Services",30,"Internal"]
[null,null,null,null,null,null,"Public Services and Community Protection","Public Services",4,"Public Services and Community Protection",30,"Internal"]
[null,null,null,null,null,null,"Health, Fitness and Lifestyle for the Public Services","Public Services",5,"Health, Fitness and Lifestyle for the Public Services",30,"Internal"]
[null,null,null,null,null,null,"Crime and its Effects on Society and Individuals","Public Services",7,"Crime and its Effects on Society and Individuals",60,"Internal"]
[null,null,null,null,null,null,"Promotion of Public Services Provision","Public Services",8,"Promotion of Public Services Provision",30,"Internal"]
[null,null,null,null,null,null,"Community and Cultural Awareness","Public Services",9,"Community and Cultural Awareness",30,"Internal"]
[null,null,null,null,null,null,"Adventurous Activities in the Public Services","Public Services",10,"Adventurous Activities in the Public Services",30,"Internal"]
[null,null,null,null,null,null,"Sport and Recreation in the Public Services","Public Services",11,"Sport and Recreation in the Public Services",30,"Internal"]
[null,null,null,null,null,null,"Land Navigation by Map and Compass","Public Services",12,"Land Navigation by Map and Compass",60,"Internal"]
[null,null,null,null,null,null,"Volunteering for the Public Services","Public Services",13,"Volunteering for the Public Services",60,"Internal"]
[null,null,null,null,null,null,"Multi-day Expedition Experience","Public Services",14,"Multi-day Expedition Experience",60,"Internal"]
[null,null,null,null,null,null,"Health and Safety in the Public Services","Public Services",15,"Health and Safety in the Public Services",30,"Internal"]
[null,null,null,null,null,null,"Employability Skills in the Public Services","Public Services",16,"Employability Skills in the Public Services",30,"Internal"]
[null,null,null,null,null,null,"Preparing to Respond to Emergency Incidents","Public Services",17,"Preparing to Respond to Emergency Incidents",60,"Internal"]
[null,null,null,null,null,null,"Security Procedures in the Public Services","Public Services",18,"Security Procedures in the Public Services",60,"Internal"]
[null,null,null,null,null,null,"Carrying out a Project in Public Services","Public Services",19,"Carrying out a Project in Public Services",60,"Internal"]
[null,null,null,null,null,null,"Law and its Impact on the Individual","Public Services",20,"Law and its Impact on the Individual",60,"Internal"]
[null,null,null,null,null,null,"The Mind and Sports Performance","Sport",3,"The Mind and Sports Performance",30,"Internal"]
[null,null,null,null,null,null,"The Sports Performer in Action","Sport",4,"The Sports Performer in Action",30,"Internal"]
[null,null,null,null,null,null,"Training for Personal Fitness","Sport",5,"Training for Personal Fitness",30,"Internal"]
[null,null,null,null,null,null,"Leading Sports Activities","Sport",6,"Leading Sports Activities",30,"Internal"]
[null,null,null,null,null,null,"Promotion and Sponsorship in Sport","Sport",8,"Promotion and Sponsorship in Sport",30,"Internal"]
[null,null,null,null,null,null,"Lifestyle and Well-being","Sport",9,"Lifestyle and Well-being",30,"Internal"]
[null,null,null,null,null,null,"Injury and the Sports Performer","Sport",10,"Injury and the Sports Performer",30,"Internal"]
[null,null,null,null,null,null,"Running a Sports Event","Sport",11,"Running a Sports Event",30,"Internal"]
[null,null,null,null,null,null,"The Sport and Active Leisure Industry","Sport",12,"The Sport and Active Leisure Industry",30,"Internal"]
[null,null,null,null,null,null,"Profiling Sports Performance","Sport",13,"Profiling Sports Performance",30,"Internal"]
[null,null,null,null,null,null,"The Development of Travel and Tourism in the UK","Travel and Tourism",3,"The Development of Travel and Tourism in the UK",30,"Internal"]
[null,null,null,null,null,null,"Factors Affecting Worldwide Travel and Tourism","Travel and Tourism",5,"Factors Affecting Worldwide Travel and Tourism",30,"Internal"]
[null,null,null,null,null,null,"The Travel and Tourism Customer Experience","Travel and Tourism",6,"The Travel and Tourism Customer Experience",30,"Internal"]
[null,null,null,null,null,null,"Promotion and Sales in Travel and Tourism","Travel and Tourism",8,"Promotion and Sales in Travel and Tourism",30,"Internal"]
[null,null,null,null,null,null,"Travel and Tourism Employment Opportunities","Travel and Tourism",9,"Travel and Tourism Employment Opportunities",30,"Internal"]
[null,null,null,null,null,null,"Organising a Travel and Tourism Study Visit","Travel and Tourism",10,"Organising a Travel and Tourism Study Visit",30,"Internal"]
[null,null,null,null,null,null,"Delivering the Travel and Tourism Customer Experience","Travel and Tourism",11,"Delivering the Travel and Tourism Customer Experience",60,"Internal"]
[null,null,null,null,null,null,"Marketing in Travel and Tourism","Travel and Tourism",12,"Marketing in Travel and Tourism",60,"Internal"]
[null,null,null,null,null,null,"Airports and Airlines","Travel and Tourism",13,"Airports and Airlines",60,"Internal"]
[null,null,null,null,null,null,"Work-related Experience in Travel and Tourism","Travel and Tourism",15,"Work-related Experience in Travel and Tourism",60,"Internal"]
[null,null,null,null,null,null,"Holiday Representatives","Travel and Tourism",16,"Holiday Representatives",30,"Internal"]
[null,null,null,null,null,null,"UK Travel Agency Operations","Travel and Tourism",17,"UK Travel Agency Operations",30,"Internal"]
[null,null,null,null,null,null,"The Cruise Industry","Travel and Tourism",18,"The Cruise Industry",30,"Internal"]
[null,null,null,null,null,null,"Hospitality Operations in the Travel and Tourism Sector","Travel and Tourism",19,"Hospitality Operations in the Travel and Tourism Sector",30,"Internal"]
[null,null,null,null,null,null,"UK Visitor Attractions","Travel and Tourism",20,"UK Visitor Attractions",30,"Internal"]
[null,null,null,null,null,null,"Health and Safety in Early Years Settings","CPLD",5,"Health and Safety in Early Years Settings",30,"Internal"]
[null,null,null,null,null,null,"Supporting Children’s Language and Literacy Development","CPLD",6,"Supporting Children’s Language and Literacy Development",30,"Internal"]
[null,null,null,null,null,null,"Making Healthy Food Choices for Children","CPLD",7,"Making Healthy Food Choices for Children",30,"Internal"]
[null,null,null,null,null,null,"Introduction to Working in the Early Years Sector","CPLD",8,"Introduction to Working in the Early Years Sector",30,"Internal"]

{"sheet":"Cert Dropdown","index":8,"n_rows":42,"n_cols":107,"rows_kept":42,"cut":false,"hidden":true,"merged":[]}
["Art and Design A",null,null,null,"Design Crafts",null,null,null,"Photography",null,null,null,"Product Design",null,null,null,"Visual Arts",null,null,null,"Visual Communication",null,null,null,"Business",null,null,null,"Construction",null,null,null,"Creative Digital Media Production A",null,null,null,"Creative Digital Media Production B",null,null,null,"Engineering A",null,null,null,"HSC",null,null,null,"Hospitality",null,null,null,"I&CT",null,null,null,"Music",null,null,null,"Acting A",null,null,null,"Acting B",null,null,null,"Dance A",null,null,null,"Dance B",null,null,null,"Musical Theatre A",null,null,null,"Musical Theatre B",null,null,null,"Production A",null,null,null,"Production B",null,null,null,"Public Services A",null,null,null,"Sport",null,null,null,"Travel A",null,null,null,"CPLD"]
["Communicating Ideas in 2D",{"$f":"IF(OR(COUNTIF(Cert!$E$20:$E$83,A2)>=1,COUNTIF(Cert!$E$20:$E$83,A8)>=1,COUNTIF(Cert!$E$20:$E$83,A10)>=1),\"\",ROW())","v":2},{"$f":"IF(ROW(A2)-ROW(A$2)+1>COUNT(B$2:B$50),\"\",INDEX(A:A,SMALL(B$2:B$50,1+ROW(A2)-ROW(A$2))))","v":"Communicating Ideas in 2D"},null,"Communicating Ideas in 2D",{"$f":"IF(COUNTIF(Cert!$E$20:$E$83,E2)>=1,\"\",ROW())","v":2},{"$f":"IF(ROW(E2)-ROW(E$2)+1>COUNT(F$2:F$50),\"\",INDEX(E:E,SMALL(F$2:F$50,1+ROW(E2)-ROW(E$2))))","v":"Communicating Ideas in 2D"},null,"Communicating Ideas in 2D",{"$f":"IF(COUNTIF(Cert!$E$20:$E$83,I2)>=1,\"\",ROW())","v":2},{"$f":"IF(ROW(I2)-ROW(I$2)+1>COUNT(J$2:J$50),\"\",INDEX(I:I,SMALL(J$2:J$50,1+ROW(I2)-ROW(I$2))))","v":"Communicating Ideas in 2D"},null,"Communicating Ideas in 2D",{"$f":"IF(OR(COUNTIF(Cert!$E$20:$E$83,M2)>=1,COUNTIF(Cert!$E$20:$E$83,M7)>=1),\"\",ROW())","v":2},{"$f":"IF(ROW(M2)-ROW(M$2)+1>COUNT(N$2:N$50),\"\",INDEX(M:M,SMALL(N$2:N$50,1+ROW(M2)-ROW(M$2))))","v":"Communicating Ideas in 2D"},null,"Developing an Art and Design Portfolio",{"$f":"IF(COUNTIF(Cert!$E$20:$E$83,Q2)>=1,\"\",ROW())","v":2},{"$f":"IF(ROW(Q2)-ROW(Q$2)+1>COUNT(R$2:R$50),\"\",INDEX(Q:Q,SMALL(R$2:R$50,1+ROW(Q2)-ROW(Q$2))))","v":"Developing an Art and Design Portfolio"},null,"Communicating Ideas in 3D",{"$f":"IF(OR(COUNTIF(Cert!$E$20:$E$83,U2)>=1,COUNTIF(Cert!$E$20:$E$83,U6)>=1,COUNTIF(Cert!$E$20:$E$83,U21)>=1),\"\",ROW())","v":2},{"$f":"IF(ROW(U2)-ROW(U$2)+1>COUNT(V$2:V$50),\"\",INDEX(U:U,SMALL(V$2:V$50,1+ROW(U2)-ROW(U$2))))","v":"Communicating Ideas in 3D"},null,"Promoting a Brand",{"$f":"IF(COUNTIF(Cert!$E$20:$E$83,Y2)>=1,\"\",ROW())","v":2},{"$f":"IF(ROW(Y2)-ROW(Y$2)+1>COUNT(Z$2:Z$50),\"\",INDEX(Y:Y,SMALL(Z$2:Z$50,1+ROW(Y2)-ROW(Y$2))))","v":"Promoting a Brand"},null,"Construction Processes and Operations",{"$f":"IF(COUNTIF(Cert!$E$20:$E$83,AC2)>=1,\"\",ROW())","v":2},{"$f":"IF(ROW(AC2)-ROW(AC$2)+1>COUNT(AD$2:AD$50),\"\",INDEX(AC:AC,SMALL(AD$2:AD$50,1+ROW(AC2)-ROW(AC$2))))","v":"Construction Processes and Operations"},null,"Digital Moving Image Production",{"$f":"IF(COUNTIF(Cert!$E$20:$E$83,AG2)>=1,\"\",ROW())","v":2},{"$f":"IF(ROW(AG2)-ROW(AG$2)+1>COUNT(AH$2:AH$50),\"\",INDEX(AG:AG,SMALL(AH$2:AH$50,1+ROW(AG2)-ROW(AG$2))))","v":"Digital Moving Image Production"},null,"Digital Editing for Moving Image",{"$f":"IF(COUNTIF(Cert!$E$20:$E$83,AK2)>=1,\"\",ROW())","v":2},{"$f":"IF(ROW(AK2)-ROW(AK$2)+1>COUNT(AL$2:AL$50),\"\",INDEX(AK:AK,SMALL(AL$2:AL$50,1+ROW(AK2)-ROW(AK$2))))","v":"Digital Editing for Moving Image"},null,"Health and Safety in Engineering",{"$f":"IF(COUNTIF(Cert!$E$20:$E$83,AO2)>=1,\"\",ROW())","v":2},{"$f":"IF(ROW(AO2)-ROW(AO$2)+1>COUNT(AP$2:AP$50),\"\",INDEX(AO:AO,SMALL(AP$2:AP$50,1+ROW(AO2)-ROW(AO$2))))","v":"Health and Safety in Engineering"},null,"Social Influences on Health and Wellbeing",{"$f":"IF(COUNTIF(Cert!$E$20:$E$83,AS2)>=1,\"\",ROW())","v":2},{"$f":"IF(ROW(AS2)-ROW(AS$2)+1>COUNT(AT$2:AT$50),\"\",INDEX(AS:AS,SMALL(AT$2:AT$50,1+ROW(AS2)-ROW(AS$2))))","v":"Social Influences on Health and Wellbeing"},null,"Costing and Controlling Finances in the Hospitality Industry",{"$f":"IF(COUNTIF(Cert!$E$20:$E$83,AW2)>=1,\"\",ROW())","v":2},{"$f":"IF(ROW(AW2)-ROW(AW$2)+1>COUNT(AX$2:AX$50),\"\",INDEX(AW:AW,SMALL(AX$2:AX$50,1+ROW(AW2)-ROW(AW$2))))","v":"Costing and Controlling Finances in the Hospitality Industry"},null,"Creating Digital Animation",{"$f":"IF(COUNTIF(Cert!$E$20:$E$83,BA2)>=1,\"\",ROW())","v":2},{"$f":"IF(ROW(BA2)-ROW(BA$2)+1>COUNT(BB$2:BB$50),\"\",INDEX(BA:BA,SMALL(BB$2:BB$50,1+ROW(BA2)-ROW(BA$2))))","v":"Creating Digital Animation"},null,"Introducing Live Sound",{"$f":"IF(COUNTIF(Cert!$E$20:$E$83,BE2)>=1,\"\",ROW())","v":2},{"$f":"IF(ROW(BE2)-ROW(BE$2)+1>COUNT(BF$2:BF$50),\"\",INDEX(BE:BE,SMALL(BF$2:BF$50,1+ROW(BE2)-ROW(BE$2))))","v":"Introducing Live Sound"},null,"Performance in Context",{"$f":"IF(COUNTIF(Cert!$E$20:$E$83,BI2)>=1,\"\",ROW())","v":2},{"$f":"IF(ROW(BI2)-ROW(BI$2)+1>COUNT(BJ$2:BJ$50),\"\",INDEX(BI:BI,SMALL(BJ$2:BJ$50,1+ROW(BI2)-ROW(BI$2))))","v":"Performance in Context"},null,"Contemporary Dance Techniques",{"$f":"IF(COUNTIF(Cert!$E$20:$E$83,BM2)>=1,\"\",ROW())","v":2},{"$f":"IF(ROW(BM2)-ROW(BM$2)+1>COUNT(BN$2:BN$50),\"\",INDEX(BM:BM,SMALL(BN$2:BN$50,1+ROW(BM2)-ROW(BM$2))))","v":"Contemporary Dance Techniques"},null,"Performance in Context",{"$f":"IF(COUNTIF(Cert!$E$20:$E$83,BQ2)>=1,\"\",ROW())","v":2},{"$f":"IF(ROW(BQ2)-ROW(BQ$2)+1>COUNT(BR$2:BR$50),\"\",INDEX(BQ:BQ,SMALL(BR$2:BR$50,1+ROW(BQ2)-ROW(BQ$2))))","v":"Performance in Context"},null,"Voice and Speech for Performers",{"$f":"IF(COUNTIF(Cert!$E$20:$E$83,BU2)>=1,\"\",ROW())","v":2},{"$f":"IF(ROW(BU2)-ROW(BU$2)+1>COUNT(BV$2:BV$50),\"\",INDEX(BU:BU,SMALL(BV$2:BV$50,1+ROW(BU2)-ROW(BU$2))))","v":"Voice and Speech for Performers"},null,"Performance in Context",{"$f":"IF(COUNTIF(Cert!$E$20:$E$83,BY2)>=1,\"\",ROW())","v":2},{"$f":"IF(ROW(BY2)-ROW(BY$2)+1>COUNT(BZ$2:BZ$50),\"\",INDEX(BY:BY,SMALL(BZ$2:BZ$50,1+ROW(BY2)-ROW(BY$2))))","v":"Performance in Context"},null,"Performing Scripted Plays",{"$f":"IF(COUNTIF(Cert!$E$20:$E$83,CC2)>=1,\"\",ROW())","v":2},{"$f":"IF(ROW(CC2)-ROW(CC$2)+1>COUNT(CD$2:CD$50),\"\",INDEX(CC:CC,SMALL(CD$2:CD$50,1+ROW(CC2)-ROW(CC$2))))","v":"Performing Scripted Plays"},null,"Performance in Context",{"$f":"IF(COUNTIF(Cert!$E$20:$E$83,CG2)>=1,\"\",ROW())","v":2},{"$f":"IF(ROW(CG2)-ROW(CG$2)+1>COUNT(CH$2:CH$50),\"\",INDEX(CG:CG,SMALL(CH$2:CH$50,1+ROW(CG2)-ROW(CG$2))))","v":"Performance in Context"},null,"Devising Performance Work",{"$f":"IF(COUNTIF(Cert!$E$20:$E$83,CK2)>=1,\"\",ROW())","v":2},{"$f":"IF(ROW(CK2)-ROW(CK$2)+1>COUNT(CL$2:CL$50),\"\",INDEX(CK:CK,SMALL(CL$2:CL$50,1+ROW(CK2)-ROW(CK$2))))","v":"Devising Performance Work"},null,"Employment in the Public Services",{"$f":"IF(COUNTIF(Cert!$E$20:$E$83,CO2)>=1,\"\",ROW())","v":2},{"$f":"IF(ROW(CO2)-ROW(CO$2)+1>COUNT(CP$2:CP$50),\"\",INDEX(CO:CO,SMALL(CP$2:CP$50,1+ROW(CO2)-ROW(CO$2))))","v":"Employment in the Public Services"},null,"The Mind and Sports Performance",{"$f":"IF(COUNTIF(Cert!$E$20:$E$83,CS2)>=1,\"\",ROW())","v":2},{"$f":"IF(ROW(CS2)-ROW(CS$2)+1>COUNT(CT$2:CT$50),\"\",INDEX(CS:CS,SMALL(CT$2:CT$50,1+ROW(CS2)-ROW(CS$2))))","v":"The Mind and Sports Performance"},null,"The Development of Travel and Tourism in the UK",{"$f":"IF(COUNTIF(Cert!$E$20:$E$83,CW2)>=1,\"\",ROW())","v":2},{"$f":"IF(ROW(CW2)-ROW(CW$2)+1>COUNT(CX$2:CX$50),\"\",INDEX(CW:CW,SMALL(CX$2:CX$50,1+ROW(CW2)-ROW(CW$2))))","v":"The Development of Travel and Tourism in the UK"},null,"Health and Safety in Early Years Settings",{"$f":"IF(COUNTIF(Cert!$E$20:$E$83,DA2)>=1,\"\",ROW())","v":2},{"$f":"IF(ROW(DA2)-ROW(DA$2)+1>COUNT(DB$2:DB$50),\"\",INDEX(DA:DA,SMALL(DB$2:DB$50,1+ROW(DA2)-ROW(DA$2))))","v":"Health and Safety in Early Years Settings"}]
["Communicating Ideas in 3D",{"$f":"IF(OR(COUNTIF(Cert!$E$20:$E$83,A3)>=1,COUNTIF(Cert!$E$20:$E$83,A6)>=1,COUNTIF(Cert!$E$20:$E$83,A10)>=1),\"\",ROW())","v":3},{"$f":"IF(ROW(A3)-ROW(A$2)+1>COUNT(B$2:B$50),\"\",INDEX(A:A,SMALL(B$2:B$50,1+ROW(A3)-ROW(A$2))))","v":"Communicating Ideas in 3D"},null,"Developing an Art and Design Portfolio",{"$f":"IF(COUNTIF(Cert!$E$20:$E$83,E3)>=1,\"\",ROW())","v":3},{"$f":"IF(ROW(E3)-ROW(E$2)+1>COUNT(F$2:F$50),\"\",INDEX(E:E,SMALL(F$2:F$50,1+ROW(E3)-ROW(E$2))))","v":"Developing an Art and Design Portfolio"},null,"Communicating Ideas in 3D",{"$f":"IF(COUNTIF(Cert!$E$20:$E$83,I3)>=1,\"\",ROW())","v":3},{"$f":"IF(ROW(I3)-ROW(I$2)+1>COUNT(J$2:J$50),\"\",INDEX(I:I,SMALL(J$2:J$50,1+ROW(I3)-ROW(I$2))))","v":"Communicating Ideas in 3D"},null,"Communicating Ideas in 3D",{"$f":"IF(COUNTIF(Cert!$E$20:$E$83,M3)>=1,\"\",ROW())","v":3},{"$f":"IF(ROW(M3)-ROW(M$2)+1>COUNT(N$2:N$50),\"\",INDEX(M:M,SMALL(N$2:N$50,1+ROW(M3)-ROW(M$2))))","v":"Communicating Ideas in 3D"},null,"Using Mobile Devices in Art and Design",{"$f":"IF(COUNTIF(Cert!$E$20:$E$83,Q3)>=1,\"\",ROW())","v":3},{"$f":"IF(ROW(Q3)-ROW(Q$2)+1>COUNT(R$2:R$50),\"\",INDEX(Q:Q,SMALL(R$2:R$50,1+ROW(Q3)-ROW(Q$2))))","v":"Using Mobile Devices in Art and Design"},null,"Developing an Art and Design Portfolio",{"$f":"IF(COUNTIF(Cert!$E$20:$E$83,U3)>=1,\"\",ROW())","v":3},{"$f":"IF(ROW(U3)-ROW(U$2)+1>COUNT(V$2:V$50),\"\",INDEX(U:U,SMALL(V$2:V$50,1+ROW(U3)-ROW(U$2))))","v":"Developing an Art and Design Portfolio"},null,"Principles of Customer Services",{"$f":"IF(COUNTIF(Cert!$E$20:$E$83,Y3)>=1,\"\",ROW())","v":3},{"$f":"IF(ROW(Y3)-ROW(Y$2)+1>COUNT(Z$2:Z$50),\"\",INDEX(Y:Y,SMALL(Z$2:Z$50,1+ROW(Y3)-ROW(Y$2))))","v":"Principles of Customer Services"},null,"Construction Drawing Techniques",{"$f":"IF(COUNTIF(Cert!$E$20:$E$83,AC3)>=1,\"\",ROW())","v":3},{"$f":"IF(ROW(AC3)-ROW(AC$2)+1>COUNT(AD$2:AD$50),\"\",INDEX(AC:AC,SMALL(AD$2:AD$50,1+ROW(AC3)-ROW(AC$2))))","v":"Construction Drawing Techniques"},null,"Digital Audio Production",{"$f":"IF(COUNTIF(Cert!$E$20:$E$83,AG3)>=1,\"\",ROW())","v":3},{"$f":"IF(ROW(AG3)-ROW(AG$2)+1>COUNT(AH$2:AH$50),\"\",INDEX(AG:AG,SMALL(AH$2:AH$50,1+ROW(AG3)-ROW(AG$2))))","v":"Digital Audio Production"},null,"Digital Photography for a Media Product",{"$f":"IF(COUNTIF(Cert!$E$20:$E$83,AK3)>=1,\"\",ROW())","v":3},{"$f":"IF(ROW(AK3)-ROW(AK$2)+1>COUNT(AL$2:AL$50),\"\",INDEX(AK:AK,SMALL(AL$2:AL$50,1+ROW(AK3)-ROW(AK$2))))","v":"Digital Photography for a Media Product"},null,"Engineering Maintenance",{"$f":"IF(COUNTIF(Cert!$E$20:$E$83,AO3)>=1,\"\",ROW())","v":3},{"$f":"IF(ROW(AO3)-ROW(AO$2)+1>COUNT(AP$2:AP$50),\"\",INDEX(AO:AO,SMALL(AP$2:AP$50,1+ROW(AO3)-ROW(AO$2))))","v":"Engineering Maintenance"},null,"Promoting Health and Wellbeing",{"$f":"IF(COUNTIF(Cert!$E$20:$E$83,AS3)>=1,\"\",ROW())","v":3},{"$f":"IF(ROW(AS3)-ROW(AS$2)+1>COUNT(AT$2:AT$50),\"\",INDEX(AS:AS,SMALL(AT$2:AT$50,1+ROW(AS3)-ROW(AS$2))))","v":"Promoting Health and Wellbeing"},null,"Enterprise in the Hospitality Industry",{"$f":"IF(COUNTIF(Cert!$E$20:$E$83,AW3)>=1,\"\",ROW())","v":3},{"$f":"IF(ROW(AW3)-ROW(AW$2)+1>COUNT(AX$2:AX$50),\"\",INDEX(AW:AW,SMALL(AX$2:AX$50,1+ROW(AW3)-ROW(AW$2))))","v":"Enterprise in the Hospitality Industry"},null,"Creating Digital Audio",{"$f":"IF(COUNTIF(Cert!$E$20:$E$83,BA3)>=1,\"\",ROW())","v":3},{"$f":"IF(ROW(BA3)-ROW(BA$2)+1>COUNT(BB$2:BB$50),\"\",INDEX(BA:BA,SMALL(BB$2:BB$50,1+ROW(BA3)-ROW(BA$2))))","v":"Creating Digital Audio"},null,"Introducing Music Composition",{"$f":"IF(COUNTIF(Cert!$E$20:$E$83,BE3)>=1,\"\",ROW())","v":3},{"$f":"IF(ROW(BE3)-ROW(BE$2)+1>COUNT(BF$2:BF$50),\"\",INDEX(BE:BE,SMALL(BF$2:BF$50,1+ROW(BE3)-ROW(BE$2))))","v":"Introducing Music Composition"},null,"Movement Skills",{"$f":"IF(COUNTIF(Cert!$E$20:$E$83,BI3)>=1,\"\",ROW())","v":3},{"$f":"IF(ROW(BI3)-ROW(BI$2)+1>COUNT(BJ$2:BJ$50),\"\",INDEX(BI:BI,SMALL(BJ$2:BJ$50,1+ROW(BI3)-ROW(BI$2))))","v":"Movement Skills"},null,"Exploring Urban Dance Styles",{"$f":"IF(COUNTIF(Cert!$E$20:$E$83,BM3)>=1,\"\",ROW())","v":3},{"$f":"IF(ROW(BM3)-ROW(BM$2)+1>COUNT(BN$2:BN$50),\"\",INDEX(BM:BM,SMALL(BN$2:BN$50,1+ROW(BM3)-ROW(BM$2))))","v":"Exploring Urban Dance Styles"},null,"Movement Skills",{"$f":"IF(COUNTIF(Cert!$E$20:$E$83,BQ3)>=1,\"\",ROW())","v":3},{"$f":"IF(ROW(BQ3)-ROW(BQ$2)+1>COUNT(BR$2:BR$50),\"\",INDEX(BQ:BQ,SMALL(BR$2:BR$50,1+ROW(BQ3)-ROW(BQ$2))))","v":"Movement Skills"},null,"Performing Scripted Plays",{"$f":"IF(COUNTIF(Cert!$E$20:$E$83,BU3)>=1,\"\",ROW())","v":3},{"$f":"IF(ROW(BU3)-ROW(BU$2)+1>COUNT(BV$2:BV$50),\"\",INDEX(BU:BU,SMALL(BV$2:BV$50,1+ROW(BU3)-ROW(BU$2))))","v":"Performing Scripted Plays"},null,"Movement Skills",{"$f":"IF(COUNTIF(Cert!$E$20:$E$83,BY3)>=1,\"\",ROW())","v":3},{"$f":"IF(ROW(BY3)-ROW(BY$2)+1>COUNT(BZ$2:BZ$50),\"\",INDEX(BY:BY,SMALL(BZ$2:BZ$50,1+ROW(BY3)-ROW(BY$2))))","v":"Movement Skills"},null,"Contemporary Dance Techniques",{"$f":"IF(COUNTIF(Cert!$E$20:$E$83,CC3)>=1,\"\",ROW())","v":3},{"$f":"IF(ROW(CC3)-ROW(CC$2)+1>COUNT(CD$2:CD$50),\"\",INDEX(CC:CC,SMALL(CD$2:CD$50,1+ROW(CC3)-ROW(CC$2))))","v":"Contemporary Dance Techniques"},null,"Design Planning for Performance",{"$f":"IF(COUNTIF(Cert!$E$20:$E$83,CG3)>=1,\"\",ROW())","v":3},{"$f":"IF(ROW(CG3)-ROW(CG$2)+1>COUNT(CH$2:CH$50),\"\",INDEX(CG:CG,SMALL(CH$2:CH$50,1+ROW(CG3)-ROW(CG$2))))","v":"Design Planning for Performance"},null,"Multimedia Performance",{"$f":"IF(COUNTIF(Cert!$E$20:$E$83,CK3)>=1,\"\",ROW())","v":3},{"$f":"IF(ROW(CK3)-ROW(CK$2)+1>COUNT(CL$2:CL$50),\"\",INDEX(CK:CK,SMALL(CL$2:CL$50,1+ROW(CK3)-ROW(CK$2))))","v":"Multimedia Performance"},null,"Public Services and Community Protection",{"$f":"IF(COUNTIF(Cert!$E$20:$E$83,CO3)>=1,\"\",ROW())","v":3},{"$f":"IF(ROW(CO3)-ROW(CO$2)+1>COUNT(CP$2:CP$50),\"\",INDEX(CO:CO,SMALL(CP$2:CP$50,1+ROW(CO3)-ROW(CO$2))))","v":"Public Services and Community Protection"},null,"The Sports Performer in Action",{"$f":"IF(COUNTIF(Cert!$E$20:$E$83,CS3)>=1,\"\",ROW())","v":3},{"$f":"IF(ROW(CS3)-ROW(CS$2)+1>COUNT(CT$2:CT$50),\"\",INDEX(CS:CS,SMALL(CT$2:CT$50,1+ROW(CS3)-ROW(CS$2))))","v":"The Sports Performer in Action"},null,"Factors Affecting Worldwide Travel and Tourism",{"$f":"IF(COUNTIF(Cert!$E$20:$E$83,CW3)>=1,\"\",ROW())","v":3},{"$f":"IF(ROW(CW3)-ROW(CW$2)+1>COUNT(CX$2:CX$50),\"\",INDEX(CW:CW,SMALL(CX$2:CX$50,1+ROW(CW3)-ROW(CW$2))))","v":"Factors Affecting Worldwide Travel and Tourism"},null,"Supporting Children’s Language and Literacy Development",{"$f":"IF(COUNTIF(Cert!$E$20:$E$83,DA3)>=1,\"\",ROW())","v":3},{"$f":"IF(ROW(DA3)-ROW(DA$2)+1>COUNT(DB$2:DB$50),\"\",INDEX(DA:DA,SMALL(DB$2:DB$50,1+ROW(DA3)-ROW(DA$2))))","v":"Supporting Children’s Language and Literacy Development"}]
["Developing an Art and Design Portfolio",{"$f":"IF(COUNTIF(Cert!$E$20:$E$83,A4)>=1,\"\",ROW())","v":4},"Developing an Art and Design Portfolio",null,"Fashion Briefs",{"$f":"IF(COUNTIF(Cert!$E$20:$E$83,E4)>=1,\"\",ROW())","v":4},"Fashion Briefs",null,"Developing an Art and Design Portfolio",{"$f":"IF(COUNTIF(Cert!$E$20:$E$83,I4)>=1,\"\",ROW())","v":4},"Developing an Art and Design Portfolio",null,"Developing an Art and Design Portfolio",{"$f":"IF(COUNTIF(Cert!$E$20:$E$83,M4)>=1,\"\",ROW())","v":4},"Developing an Art and Design Portfolio",null,"Design Crafts Briefs",{"$f":"IF(COUNTIF(Cert!$E$20:$E$83,Q4)>=1,\"\",ROW())","v":4},"Design Crafts Briefs",null,"Using Mobile Devices in Art and Design",{"$f":"IF(COUNTIF(Cert!$E$20:$E$83,U4)>=1,\"\",ROW())","v":4},"Using Mobile Devices in Art and Design",null,"Sales and Personal Selling",{"$f":"IF(COUNTIF(Cert!$E$20:$E$83,Y4)>=1,\"\",ROW())","v":4},"Sales and Personal Selling",null,"Exploring Carpentry and Joinery Principles and Techniques",{"$f":"IF(COUNTIF(Cert!$E$20:$E$83,AC4)>=1,\"\",ROW())","v":4},"Exploring Carpentry and Joinery Principles and Techniques",null,"Digital Publishing Production",{"$f":"IF(COUNTIF(Cert!$E$20:$E$83,AG4)>=1,\"\",ROW())","v":4},"Digital Publishing Production",null,"Animation for Digital Media",{"$f":"IF(COUNTIF(Cert!$E$20:$E$83,AK4)>=1,\"\",ROW())","v":4},"Animation for Digital Media",null,"Engineering Materials",{"$f":"IF(COUNTIF(Cert!$E$20:$E$83,AO4)>=1,\"\",ROW())","v":4},"Engineering Materials",null,"The Impact of Nutrition on Health and Wellbeing",{"$f":"IF(COUNTIF(Cert!$E$20:$E$83,AS4)>=1,\"\",ROW())","v":4},"The Impact of Nutrition on Health and Wellbeing",null,"Planning, Preparing, Cooking and Finishing Food",{"$f":"IF(COUNTIF(Cert!$E$20:$E$83,AW4)>=1,\"\",ROW())","v":4},"Planning, Preparing, Cooking and Finishing Food",null,"Creating Digital Graphics",{"$f":"IF(COUNTIF(Cert!$E$20:$E$83,BA4)>=1,\"\",ROW())","v":4},"Creating Digital Graphics",null,"Introducing Music Performance",{"$f":"IF(COUNTIF(Cert!$E$20:$E$83,BE4)>=1,\"\",ROW())","v":4},"Introducing Music Performance",null,"Devising Performance Work",{"$f":"IF(COUNTIF(Cert!$E$20:$E$83,BI4)>=1,\"\",ROW())","v":4},"Devising Performance Work",null,"Jazz Dance Techniques",{"$f":"IF(COUNTIF(Cert!$E$20:$E$83,BM4)>=1,\"\",ROW())","v":4},"Jazz Dance Techniques",null,"Devising Performance Work",{"$f":"IF(COUNTIF(Cert!$E$20:$E$83,BQ4)>=1,\"\",ROW())","v":4},"Devising Performance Work",null,"Design Planning for Performance",{"$f":"IF(COUNTIF(Cert!$E$20:$E$83,BU4)>=1,\"\",ROW())","v":4},"Design Planning for Performance",null,"Devising Performance Work",{"$f":"IF(COUNTIF(Cert!$E$20:$E$83,BY4)>=1,\"\",ROW())","v":4},"Devising Performance Work",null,"Exploring Urban Dance Styles",{"$f":"IF(COUNTIF(Cert!$E$20:$E$83,CC4)>=1,\"\",ROW())","v":4},"Exploring Urban Dance Styles",null,"Realising Costume Design for Performance",{"$f":"IF(COUNTIF(Cert!$E$20:$E$83,CG4)>=1,\"\",ROW())","v":4},"Realising Costume Design for Performance",null,"Voice and Speech for Performers",{"$f":"IF(COUNTIF(Cert!$E$20:$E$83,CK4)>=1,\"\",ROW())","v":4},"Voice and Speech for Performers",null,"Health, Fitness and Lifestyle for the Public Services",{"$f":"IF(COUNTIF(Cert!$E$20:$E$83,CO4)>=1,\"\",ROW())","v":4},"Health, Fitness and Lifestyle for the Public Services",null,"Training for Personal Fitness",{"$f":"IF(COUNTIF(Cert!$E$20:$E$83,CS4)>=1,\"\",ROW())","v":4},"Training for Personal Fitness",null,"The Travel and Tourism Customer Experience",{"$f":"IF(OR(COUNTIF(Cert!$E$20:$E$83,CW4)>=1,COUNTIF(Cert!$E$20:$E$83,CW8)>=1),\"\",ROW())","v":4},"The Travel and Tourism Customer Experience",null,"Making Healthy Food Choices for Children",{"$f":"IF(COUNTIF(Cert!$E$20:$E$83,DA4)>=1,\"\",ROW())","v":4},"Making Healthy Food Choices for Children"]
["Using Mobile Devices in Art and Design",{"$f":"IF(COUNTIF(Cert!$E$20:$E$83,A5)>=1,\"\",ROW())","v":5},"Using Mobile Devices in Art and Design",null,"Textiles Briefs",{"$f":"IF(COUNTIF(Cert!$E$20:$E$83,E5)>=1,\"\",ROW())","v":5},"Textiles Briefs",null,"Using Mobile Devices in Art and Design",{"$f":"IF(COUNTIF(Cert!$E$20:$E$83,I5)>=1,\"\",ROW())","v":5},"Using Mobile Devices in Art and Design",null,"Using Mobile Devices in Art and Design",{"$f":"IF(COUNTIF(Cert!$E$20:$E$83,M5)>=1,\"\",ROW())","v":5},"Using Mobile Devices in Art and Design",null,"Fashion Briefs",{"$f":"IF(COUNTIF(Cert!$E$20:$E$83,Q5)>=1,\"\",ROW())","v":5},"Fashion Briefs",null,"Fashion Briefs",{"$f":"IF(COUNTIF(Cert!$E$20:$E$83,U5)>=1,\"\",ROW())","v":5},"Fashion Briefs",null,"Introducing Retail Business",{"$f":"IF(COUNTIF(Cert!$E$20:$E$83,Y5)>=1,\"\",ROW())","v":5},"Introducing Retail Business",null,"Exploring Brickwork and Blockwork Principles and Techniques",{"$f":"IF(COUNTIF(Cert!$E$20:$E$83,AC5)>=1,\"\",ROW())","v":5},"Exploring Brickwork and Blockwork Principles and Techniques",null,"Website Production",{"$f":"IF(COUNTIF(Cert!$E$20:$E$83,AG5)>=1,\"\",ROW())","v":5},"Website Production",null,"Digital Audio Editing",{"$f":"IF(COUNTIF(Cert!$E$20:$E$83,AK5)>=1,\"\",ROW())","v":5},"Digital Audio Editing",null,"Computer-aided Engineering",{"$f":"IF(COUNTIF(Cert!$E$20:$E$83,AO5)>=1,\"\",ROW())","v":5},"Computer-aided Engineering",null,"Equality and Diversity in Health and Social Care",{"$f":"IF(COUNTIF(Cert!$E$20:$E$83,AS5)>=1,\"\",ROW())","v":5},"Equality and Diversity in Health and Social Care",null,"Food and Beverage Service in the Hospitality Industry",{"$f":"IF(COUNTIF(Cert!$E$20:$E$83,AW5)>=1,\"\",ROW())","v":5},"Food and Beverage Service in the Hospitality Industry",null,"Creating Digital Video",{"$f":"IF(COUNTIF(Cert!$E$20:$E$83,BA5)>=1,\"\",ROW())","v":5},"Creating Digital Video",null,"Introducing Music Recording",{"$f":"IF(COUNTIF(Cert!$E$20:$E$83,BE5)>=1,\"\",ROW())","v":5},"Introducing Music Recording",null,"Exploring Improvisation",{"$f":"IF(COUNTIF(Cert!$E$20:$E$83,BI5)>=1,\"\",ROW())","v":5},"Exploring Improvisation",null,"Design Planning for Performance",{"$f":"IF(COUNTIF(Cert!$E$20:$E$83,BM5)>=1,\"\",ROW())","v":5},"Design Planning for Performance",null,"Multimedia Performance",{"$f":"IF(COUNTIF(Cert!$E$20:$E$83,BQ5)>=1,\"\",ROW())","v":5},"Multimedia Performance",null,"Realising Costume Design for Performance",{"$f":"IF(COUNTIF(Cert!$E$20:$E$83,BU5)>=1,\"\",ROW())","v":5},"Realising Costume Design for Performance",null,"Voice and Speech for Performers",{"$f":"IF(COUNTIF(Cert!$E$20:$E$83,BY5)>=1,\"\",ROW())","v":5},"Voice and Speech for Performers",null,"Jazz Dance Techniques",{"$f":"IF(COUNTIF(Cert!$E$20:$E$83,CC5)>=1,\"\",ROW())","v":5},"Jazz Dance Techniques",null,"Realising Set Design for Performance",{"$f":"IF(COUNTIF(Cert!$E$20:$E$83,CG5)>=1,\"\",ROW())","v":5},"Realising Set Design for Performance",null,"Performing Scripted Plays",{"$f":"IF(COUNTIF(Cert!$E$20:$E$83,CK5)>=1,\"\",ROW())","v":5},"Performing Scripted Plays",null,"Crime and its Effects on Society and Individuals",{"$f":"IF(COUNTIF(Cert!$E$20:$E$83,CO5)>=1,\"\",ROW())","v":5},"Crime and its Effects on Society and Individuals",null,"Leading Sports Activities",{"$f":"IF(COUNTIF(Cert!$E$20:$E$83,CS5)>=1,\"\",ROW())","v":5},"Leading Sports Activities",null,"Promotion and Sales in Travel and Tourism",{"$f":"IF(COUNTIF(Cert!$E$20:$E$83,CW5)>=1,\"\",ROW())","v":5},"Promotion and Sales in Travel and Tourism",null,"Introduction to Working in the Early Years Sector",{"$f":"IF(COUNTIF(Cert!$E$20:$E$83,DA5)>=1,\"\",ROW())","v":5},"Introduction to Working in the Early Years Sector"]
["Design Crafts Briefs",{"$f":"IF(OR(COUNTIF(Cert!$E$20:$E$83,A3)>=1,COUNTIF(Cert!$E$20:$E$83,A6)>=1),\"\",ROW())","v":6},"Design Crafts Briefs",null,"Designing for the Future",{"$f":"IF(COUNTIF(Cert!$E$20:$E$83,E6)>=1,\"\",ROW())","v":6},"Designing for the Future",null,"Fashion Briefs",{"$f":"IF(COUNTIF(Cert!$E$20:$E$83,I6)>=1,\"\",ROW())","v":6},"Fashion Briefs",null,"Fashion Briefs",{"$f":"IF(COUNTIF(Cert!$E$20:$E$83,M6)>=1,\"\",ROW())","v":6},"Fashion Briefs",null,"Graphic Design Briefs",{"$f":"IF(COUNTIF(Cert!$E$20:$E$83,Q6)>=1,\"\",ROW())","v":6},"Graphic Design Briefs",null,"Visual Arts Briefs",{"$f":"IF(OR(COUNTIF(Cert!$E$20:$E$83,U6)>=1,COUNTIF(Cert!$E$20:$E$83,U2)>=1),\"\",ROW())","v":6},"Visual Arts Briefs",null,"Providing Business Support",{"$f":"IF(COUNTIF(Cert!$E$20:$E$83,Y6)>=1,\"\",ROW())","v":6},"Providing Business Support",null,"Exploring Painting and Decorating Principles and Techniques",{"$f":"IF(COUNTIF(Cert!$E$20:$E$83,AC6)>=1,\"\",ROW())","v":6},"Exploring Painting and Decorating Principles and Techniques",null,"Digital Games Production",{"$f":"IF(COUNTIF(Cert!$E$20:$E$83,AG6)>=1,\"\",ROW())","v":6},"Digital Games Production",null,"Graphic Design for Digital Media",{"$f":"IF(COUNTIF(Cert!$E$20:$E$83,AK6)>=1,\"\",ROW())","v":6},"Graphic Design for Digital Media",null,"Machining Techniques",{"$f":"IF(COUNTIF(Cert!$E$20:$E$83,AO6)>=1,\"\",ROW())","v":6},"Machining Techniques",null,"Individual Rights in Health and Social Care",{"$f":"IF(COUNTIF(Cert!$E$20:$E$83,AS6)>=1,\"\",ROW())","v":6},"Individual Rights in Health and Social Care",null,"Front Office Services in the Hospitality Industry",{"$f":"IF(COUNTIF(Cert!$E$20:$E$83,AW6)>=1,\"\",ROW())","v":6},"Front Office Services in the Hospitality Industry",null,"Mobile Apps Development",{"$f":"IF(COUNTIF(Cert!$E$20:$E$83,BA6)>=1,\"\",ROW())","v":6},"Mobile Apps Development",null,"Introducing Music Sequencing",{"$f":"IF(COUNTIF(Cert!$E$20:$E$83,BE6)>=1,\"\",ROW())","v":6},"Introducing Music Sequencing",null,"Multimedia Performance",{"$f":"IF(COUNTIF(Cert!$E$20:$E$83,BI6)>=1,\"\",ROW())","v":6},"Multimedia Performance",null,"Realising Costume Design for Performance",{"$f":"IF(COUNTIF(Cert!$E$20:$E$83,BM6)>=1,\"\",ROW())","v":6},"Realising Costume Design for Performance",null,"Contemporary Dance Techniques",{"$f":"IF(COUNTIF(Cert!$E$20:$E$83,BQ6)>=1,\"\",ROW())","v":6},"Contemporary Dance Techniques",null,"Realising Set Design for Performance",{"$f":"IF(COUNTIF(Cert!$E$20:$E$83,BU6)>=1,\"\",ROW())","v":6},"Realising Set Design for Performance",null,null,null,null,null,"Design Planning for Performance",{"$f":"IF(COUNTIF(Cert!$E$20:$E$83,CC6)>=1,\"\",ROW())","v":6},"Design Planning for Performance",null,"Realising Prop Design for Performance",{"$f":"IF(COUNTIF(Cert!$E$20:$E$83,CG6)>=1,\"\",ROW())","v":6},"Realising Prop Design for Performance",null,"Contemporary Dance Techniques",{"$f":"IF(COUNTIF(Cert!$E$20:$E$83,CK6)>=1,\"\",ROW())","v":6},"Contemporary Dance Techniques",null,"Promotion of Public Services Provision",{"$f":"IF(COUNTIF(Cert!$E$20:$E$83,CO6)>=1,\"\",ROW())","v":6},"Promotion of Public Services Provision",null,"Promotion and Sponsorship in Sport",{"$f":"IF(COUNTIF(Cert!$E$20:$E$83,CS6)>=1,\"\",ROW())","v":6},"Promotion and Sponsorship in Sport",null,"Travel and Tourism Employment Opportunities",{"$f":"IF(COUNTIF(Cert!$E$20:$E$83,CW6)>=1,\"\",ROW())","v":6},"Travel and Tourism Employment Opportunities"]
["Fashion Briefs",{"$f":"IF(COUNTIF(Cert!$E$20:$E$83,A7)>=1,\"\",ROW())","v":7},"Fashion Briefs",null,null,null,null,null,"Designing for the Future",{"$f":"IF(COUNTIF(Cert!$E$20:$E$83,I7)>=1,\"\",ROW())","v":7},"Designing for the Future",null,"Graphic Design Briefs",{"$f":"IF(OR(COUNTIF(Cert!$E$20:$E$83,M2)>=1,COUNTIF(Cert!$E$20:$E$83,M7)>=1),\"\",ROW())","v":7},"Graphic Design Briefs",null,"Textiles Briefs",{"$f":"IF(COUNTIF(Cert!$E$20:$E$83,Q7)>=1,\"\",ROW())","v":7},"Textiles Briefs",null,"Photography Briefs",{"$f":"IF(COUNTIF(Cert!$E$20:$E$83,U7)>=1,\"\",ROW())","v":7},"Photography Briefs",null,"Recruitment, Selection and Employment",{"$f":"IF(OR(COUNTIF(Cert!$E$20:$E$83,Y7)>=1,COUNTIF(Cert!$E$20:$E$83,Y22)>=1),\"\",ROW())","v":7},"Recruitment, Selection and Employment",null,"Exploring Plumbing Principles and Techniques",{"$f":"IF(COUNTIF(Cert!$E$20:$E$83,AC7)>=1,\"\",ROW())","v":7},"Exploring Plumbing Principles and Techniques",null,null,null,null,null,"Writing for Digital Media",{"$f":"IF(COUNTIF(Cert!$E$20:$E$83,AK7)>=1,\"\",ROW())","v":7},"Writing for Digital Media",null,"Electronic Circuit Design and Construction",{"$f":"IF(COUNTIF(Cert!$E$20:$E$83,AO7)>=1,\"\",ROW())","v":7},"Electronic Circuit Design and Construction",null,"Human Body Systems and Care of Disorders",{"$f":"IF(COUNTIF(Cert!$E$20:$E$83,AS7)>=1,\"\",ROW())","v":7},"Human Body Systems and Care of Disorders",null,"Marketing and Promotion in Hospitality",{"$f":"IF(COUNTIF(Cert!$E$20:$E$83,AW7)>=1,\"\",ROW())","v":7},"Marketing and Promotion in Hospitality",null,"Spreadsheet Development",{"$f":"IF(COUNTIF(Cert!$E$20:$E$83,BA7)>=1,\"\",ROW())","v":7},"Spreadsheet Development",null,"Introducing Choral Studies",{"$f":"IF(COUNTIF(Cert!$E$20:$E$83,BE7)>=1,\"\",ROW())","v":7},"Introducing Choral Studies",null,"Voice and Speech for Performers",{"$f":"IF(COUNTIF(Cert!$E$20:$E$83,BI7)>=1,\"\",ROW())","v":7},"Voice and Speech for Performers",null,"Realising Set Design for Performance",{"$f":"IF(COUNTIF(Cert!$E$20:$E$83,BM7)>=1,\"\",ROW())","v":7},"Realising Set Design for Performance",null,"Exploring Urban Dance Styles",{"$f":"IF(COUNTIF(Cert!$E$20:$E$83,BQ7)>=1,\"\",ROW())","v":7},"Exploring Urban Dance Styles",null,"Realising Prop Design for Performance",{"$f":"IF(COUNTIF(Cert!$E$20:$E$83,BU7)>=1,\"\",ROW())","v":7},"Realising Prop Design for Performance",null,null,null,null,null,"Realising Costume Design for Performance",{"$f":"IF(COUNTIF(Cert!$E$20:$E$83,CC7)>=1,\"\",ROW())","v":7},"Realising Costume Design for Performance",null,"Realising Mask Design for Performance",{"$f":"IF(COUNTIF(Cert!$E$20:$E$83,CG7)>=1,\"\",ROW())","v":7},"Realising Mask Design for Performance",null,"Exploring Urban Dance Styles",{"$f":"IF(COUNTIF(Cert!$E$20:$E$83,CK7)>=1,\"\",ROW())","v":7},"Exploring Urban Dance Styles",null,"Community and Cultural Awareness",{"$f":"IF(COUNTIF(Cert!$E$20:$E$83,CO7)>=1,\"\",ROW())","v":7},"Community and Cultural Awareness",null,"Lifestyle and Well-being",{"$f":"IF(COUNTIF(Cert!$E$20:$E$83,CS7)>=1,\"\",ROW())","v":7},"Lifestyle and Well-being",null,"Organising a Travel and Tourism Study Visit",{"$f":"IF(COUNTIF(Cert!$E$20:$E$83,CW7)>=1,\"\",ROW())","v":7},"Organising a Travel and Tourism Study Visit"]
["Graphic Design Briefs",{"$f":"IF(OR(COUNTIF(Cert!$E$20:$E$83,A2)>=1,COUNTIF(Cert!$E$20:$E$83,A8)>=1),\"\",ROW())","v":8},"Graphic Design Briefs",null,null,null,null,null,"Studio Photography",{"$f":"IF(COUNTIF(Cert!$E$20:$E$83,I8)>=1,\"\",ROW())","v":8},"Studio Photography",null,"Textiles Briefs",{"$f":"IF(COUNTIF(Cert!$E$20:$E$83,M8)>=1,\"\",ROW())","v":8},"Textiles Briefs",null,"Photography Briefs",{"$f":"IF(COUNTIF(Cert!$E$20:$E$83,Q8)>=1,\"\",ROW())","v":8},"Photography Briefs",null,"Designing for the Future",{"$f":"IF(COUNTIF(Cert!$E$20:$E$83,U8)>=1,\"\",ROW())","v":8},"Designing for the Future",null,"Using Business Documentation",{"$f":"IF(COUNTIF(Cert!$E$20:$E$83,Y8)>=1,\"\",ROW())","v":8},"Using Business Documentation",null,"Exploring Electrical Principles and Techniques",{"$f":"IF(COUNTIF(Cert!$E$20:$E$83,AC8)>=1,\"\",ROW())","v":8},"Exploring Electrical Principles and Techniques",null,null,null,null,null,"Digital Games Testing",{"$f":"IF(COUNTIF(Cert!$E$20:$E$83,AK8)>=1,\"\",ROW())","v":8},"Digital Games Testing",null,"Electrical and Mechanical Science for Engineering",{"$f":"IF(COUNTIF(Cert!$E$20:$E$83,AO8)>=1,\"\",ROW())","v":8},"Electrical and Mechanical Science for Engineering",null,"Services in Health and Social Care",{"$f":"IF(COUNTIF(Cert!$E$20:$E$83,AS8)>=1,\"\",ROW())","v":8},"Services in Health and Social Care",null,"Accommodation Services in the Hospitality Industry",{"$f":"IF(COUNTIF(Cert!$E$20:$E$83,AW8)>=1,\"\",ROW())","v":8},"Accommodation Services in the Hospitality Industry",null,"Database Development",{"$f":"IF(COUNTIF(Cert!$E$20:$E$83,BA8)>=1,\"\",ROW())","v":8},"Database Development",null,"Introducing Music Theory",{"$f":"IF(COUNTIF(Cert!$E$20:$E$83,BE8)>=1,\"\",ROW())","v":8},"Introducing Music Theory",null,"Performing Scripted Plays",{"$f":"IF(COUNTIF(Cert!$E$20:$E$83,BI8)>=1,\"\",ROW())","v":8},"Performing Scripted Plays",null,"Realising Prop Design for Performance",{"$f":"IF(COUNTIF(Cert!$E$20:$E$83,BM8)>=1,\"\",ROW())","v":8},"Realising Prop Design for Performance",null,"Jazz Dance Techniques",{"$f":"IF(COUNTIF(Cert!$E$20:$E$83,BQ8)>=1,\"\",ROW())","v":8},"Jazz Dance Techniques",null,"Realising Mask Design for Performance",{"$f":"IF(COUNTIF(Cert!$E$20:$E$83,BU8)>=1,\"\",ROW())","v":8},"Realising Mask Design for Performance",null,null,null,null,null,"Realising Set Design for Performance",{"$f":"IF(COUNTIF(Cert!$E$20:$E$83,CC8)>=1,\"\",ROW())","v":8},"Realising Set Design for Performance",null,"Lighting for Performance",{"$f":"IF(COUNTIF(Cert!$E$20:$E$83,CG8)>=1,\"\",ROW())","v":8},"Lighting for Performance",null,"Jazz Dance Techniques",{"$f":"IF(COUNTIF(Cert!$E$20:$E$83,CK8)>=1,\"\",ROW())","v":8},"Jazz Dance Techniques",null,"Adventurous Activities in the Public Services",{"$f":"IF(OR(COUNTIF(Cert!$E$20:$E$83,CO8)>=1,COUNTIF(Cert!$E$20:$E$83,CO12)>=1),\"\",ROW())","v":8},"Adventurous Activities in the Public Services",null,"Injury and the Sports Performer",{"$f":"IF(COUNTIF(Cert!$E$20:$E$83,CS8)>=1,\"\",ROW())","v":8},"Injury and the Sports Performer",null,"Delivering the Travel and Tourism Customer Experience",{"$f":"IF(OR(COUNTIF(Cert!$E$20:$E$83,CW4)>=1,COUNTIF(Cert!$E$20:$E$83,CW8)>=1),\"\",ROW())","v":8},"Delivering the Travel and Tourism Customer Experience"]
["Textiles Briefs",{"$f":"IF(COUNTIF(Cert!$E$20:$E$83,A9)>=1,\"\",ROW())","v":9},"Textiles Briefs",null,null,null,null,null,"Location Photography",{"$f":"IF(COUNTIF(Cert!$E$20:$E$83,I9)>=1,\"\",ROW())","v":9},"Location Photography",null,null,null,null,null,"Printmaking Briefs",{"$f":"IF(COUNTIF(Cert!$E$20:$E$83,Q9)>=1,\"\",ROW())","v":9},"Printmaking Briefs",null,"Applying Contextual References in Art and Design",{"$f":"IF(COUNTIF(Cert!$E$20:$E$83,U9)>=1,\"\",ROW())","v":9},"Applying Contextual References in Art and Design",null,"Building Successful Business Teams",{"$f":"IF(COUNTIF(Cert!$E$20:$E$83,Y9)>=1,\"\",ROW())","v":9},"Building Successful Business Teams",null,"Sustainability in Construction",{"$f":"IF(COUNTIF(Cert!$E$20:$E$83,AC9)>=1,\"\",ROW())","v":9},"Sustainability in Construction",null,null,null,null,null,null,null,null,null,"Engineering Design",{"$f":"IF(COUNTIF(Cert!$E$20:$E$83,AO9)>=1,\"\",ROW())","v":9},"Engineering Design",null,"Creative and Therapeutic Activities in Health and Social Care",{"$f":"IF(COUNTIF(Cert!$E$20:$E$83,AS9)>=1,\"\",ROW())","v":9},"Creative and Therapeutic Activities in Health and Social Care",null,"Planning and Running a Hospitality Event",{"$f":"IF(COUNTIF(Cert!$E$20:$E$83,AW9)>=1,\"\",ROW())","v":9},"Planning and Running a Hospitality Event",null,"Computer Networks",{"$f":"IF(COUNTIF(Cert!$E$20:$E$83,BA9)>=1,\"\",ROW())","v":9},"Computer Networks",null,"Developing Solo Music Performance",{"$f":"IF(COUNTIF(Cert!$E$20:$E$83,BE9)>=1,\"\",ROW())","v":9},"Developing Solo Music Performance",null,"Community Arts",{"$f":"IF(COUNTIF(Cert!$E$20:$E$83,BI9)>=1,\"\",ROW())","v":9},"Community Arts",null,"Realising Mask Design for Performance",{"$f":"IF(COUNTIF(Cert!$E$20:$E$83,BM9)>=1,\"\",ROW())","v":9},"Realising Mask Design for Performance",null,"Physical Theatre Performance",{"$f":"IF(COUNTIF(Cert!$E$20:$E$83,BQ9)>=1,\"\",ROW())","v":9},"Physical Theatre Performance",null,"Lighting for Performance",{"$f":"IF(COUNTIF(Cert!$E$20:$E$83,BU9)>=1,\"\",ROW())","v":9},"Lighting for Performance",null,null,null,null,null,"Realising Prop Design for Performance",{"$f":"IF(COUNTIF(Cert!$E$20:$E$83,CC9)>=1,\"\",ROW())","v":9},"Realising Prop Design for Performance",null,"Sound for Performance",{"$f":"IF(COUNTIF(Cert!$E$20:$E$83,CG9)>=1,\"\",ROW())","v":9},"Sound for Performance",null,null,null,null,null,"Sport and Recreation in the Public Services",{"$f":"IF(COUNTIF(Cert!$E$20:$E$83,CO9)>=1,\"\",ROW())","v":9},"Sport and Recreation in the Public Services",null,"Running a Sports Event",{"$f":"IF(COUNTIF(Cert!$E$20:$E$83,CS9)>=1,\"\",ROW())","v":9},"Running a Sports Event",null,"Marketing in Travel and Tourism",{"$f":"IF(COUNTIF(Cert!$E$20:$E$83,CW9)>=1,\"\",ROW())","v":9},"Marketing in Travel and Tourism"]
["Visual Arts Briefs",{"$f":"IF(OR(COUNTIF(Cert!$E$20:$E$83,A2)>=1,COUNTIF(Cert!$E$20:$E$83,A3)>=1,COUNTIF(Cert!$E$20:$E$83,A10)>=1),\"\",ROW())","v":10},"Visual Arts Briefs",null,null,null,null,null,"Editing Photographic Images",{"$f":"IF(COUNTIF(Cert!$E$20:$E$83,I10)>=1,\"\",ROW())","v":10},"Editing Photographic Images",null,null,null,null,null,"Drawing from Observation",{"$f":"IF(COUNTIF(Cert!$E$20:$E$83,Q10)>=1,\"\",ROW())","v":10},"Drawing from Observation",null,"Art, Craft and Design in the Creative Industries",{"$f":"IF(COUNTIF(Cert!$E$20:$E$83,U10)>=1,\"\",ROW())","v":10},"Art, Craft and Design in the Creative Industries",null,"Introducing Law and Consumer Rights",{"$f":"IF(COUNTIF(Cert!$E$20:$E$83,Y10)>=1,\"\",ROW())","v":10},"Introducing Law and Consumer Rights",null,"Exploring Roofing Principles and Techniques",{"$f":"IF(COUNTIF(Cert!$E$20:$E$83,AC10)>=1,\"\",ROW())","v":10},"Exploring Roofing Principles and Techniques",null,null,null,null,null,null,null,null,null,"Engineering Assembly",{"$f":"IF(COUNTIF(Cert!$E$20:$E$83,AO10)>=1,\"\",ROW())","v":10},"Engineering Assembly",null,null,null,null,null,"Contemporary World Food Cooking Skills",{"$f":"IF(COUNTIF(Cert!$E$20:$E$83,AW10)>=1,\"\",ROW())","v":10},"Contemporary World Food Cooking Skills",null,"Software Development",{"$f":"IF(COUNTIF(Cert!$E$20:$E$83,BA10)>=1,\"\",ROW())","v":10},"Software Development",null,"The Development of Music",{"$f":"IF(COUNTIF(Cert!$E$20:$E$83,BE10)>=1,\"\",ROW())","v":10},"The Development of Music",null,"Directing Performance",{"$f":"IF(COUNTIF(Cert!$E$20:$E$83,BI10)>=1,\"\",ROW())","v":10},"Directing Performance",null,"Lighting for Performance",{"$f":"IF(COUNTIF(Cert!$E$20:$E$83,BM10)>=1,\"\",ROW())","v":10},"Lighting for Performance",null,"Variety Performance",{"$f":"IF(COUNTIF(Cert!$E$20:$E$83,BQ10)>=1,\"\",ROW())","v":10},"Variety Performance",null,"Sound for Performance",{"$f":"IF(COUNTIF(Cert!$E$20:$E$83,BU10)>=1,\"\",ROW())","v":10},"Sound for Performance",null,null,null,null,null,"Realising Mask Design for Performance",{"$f":"IF(COUNTIF(Cert!$E$20:$E$83,CC10)>=1,\"\",ROW())","v":10},"Realising Mask Design for Performance",null,"Supporting Performance: Stage Management",{"$f":"IF(COUNTIF(Cert!$E$20:$E$83,CG10)>=1,\"\",ROW())","v":10},"Supporting Performance: Stage Management",null,null,null,null,null,"Land Navigation by Map and Compass",{"$f":"IF(COUNTIF(Cert!$E$20:$E$83,CO10)>=1,\"\",ROW())","v":10},"Land Navigation by Map and Compass",null,"The Sport and Active Leisure Industry",{"$f":"IF(COUNTIF(Cert!$E$20:$E$83,CS10)>=1,\"\",ROW())","v":10},"The Sport and Active Leisure Industry",null,"Airports and Airlines",{"$f":"IF(COUNTIF(Cert!$E$20:$E$83,CW10)>=1,\"\",ROW())","v":10},"Airports and Airlines"]
["Photography Briefs",{"$f":"IF(COUNTIF(Cert!$E$20:$E$83,A11)>=1,\"\",ROW())","v":11},"Photography Briefs",null,null,null,null,null,null,null,null,null,null,null,null,null,"Surface Design",{"$f":"IF(COUNTIF(Cert!$E$20:$E$83,Q11)>=1,\"\",ROW())","v":11},"Surface Design",null,"Digital Art and Design Briefs",{"$f":"IF(COUNTIF(Cert!$E$20:$E$83,U11)>=1,\"\",ROW())","v":11},"Digital Art and Design Briefs",null,"Financial Planning and Forecasting",{"$f":"IF(COUNTIF(Cert!$E$20:$E$83,Y11)>=1,\"\",ROW())","v":11},"Financial Planning and Forecasting",null,"Exploring Wall and Floor Tiling Principles and Techniques",{"$f":"IF(COUNTIF(Cert!$E$20:$E$83,AC11)>=1,\"\",ROW())","v":11},"Exploring Wall and Floor Tiling Principles and Techniques",null,null,null,null,null,null,null,null,null,"Vehicle Engines and Other Systems",{"$f":"IF(COUNTIF(Cert!$E$20:$E$83,AO11)>=1,\"\",ROW())","v":11},"Vehicle Engines and Other Systems",null,null,null,null,null,"Teamwork in Hospitality",{"$f":"IF(COUNTIF(Cert!$E$20:$E$83,AW11)>=1,\"\",ROW())","v":11},"Teamwork in Hospitality",null,"Website Development",{"$f":"IF(COUNTIF(Cert!$E$20:$E$83,BA11)>=1,\"\",ROW())","v":11},"Website Development",null,"Developing Music Composition",{"$f":"IF(COUNTIF(Cert!$E$20:$E$83,BE11)>=1,\"\",ROW())","v":11},"Developing Music Composition",null,"Planning and Managing a Performing Arts Event",{"$f":"IF(COUNTIF(Cert!$E$20:$E$83,BI11)>=1,\"\",ROW())","v":11},"Planning and Managing a Performing Arts Event",null,"Sound for Performance",{"$f":"IF(COUNTIF(Cert!$E$20:$E$83,BM11)>=1,\"\",ROW())","v":11},"Sound for Performance",null,"Singing Skills in the Performing Arts",{"$f":"IF(COUNTIF(Cert!$E$20:$E$83,BQ11)>=1,\"\",ROW())","v":11},"Singing Skills in the Performing Arts",null,"Make-up for Performance",{"$f":"IF(COUNTIF(Cert!$E$20:$E$83,BU11)>=1,\"\",ROW())","v":11},"Make-up for Performance",null,null,null,null,null,"Lighting for Performance",{"$f":"IF(COUNTIF(Cert!$E$20:$E$83,CC11)>=1,\"\",ROW())","v":11},"Lighting for Performance",null,"Supporting Performance: Front of House",{"$f":"IF(COUNTIF(Cert!$E$20:$E$83,CG11)>=1,\"\",ROW())","v":11},"Supporting Performance: Front of House",null,null,null,null,null,"Volunteering for the Public Services",{"$f":"IF(COUNTIF(Cert!$E$20:$E$83,CO11)>=1,\"\",ROW())","v":11},"Volunteering for the Public Services",null,"Profiling Sports Performance",{"$f":"IF(COUNTIF(Cert!$E$20:$E$83,CS11)>=1,\"\",ROW())","v":11},"Profiling Sports Performance",null,"Work-related Experience in Travel and Tourism",{"$f":"IF(COUNTIF(Cert!$E$20:$E$83,CW11)>=1,\"\",ROW())","v":11},"Work-related Experience in Travel and Tourism"]
["Designing for the Future",{"$f":"IF(COUNTIF(Cert!$E$20:$E$83,A12)>=1,\"\",ROW())","v":12},"Designing for the Future",null,null,null,null,null,null,null,null,null,null,null,null,null,"Sculpture",{"$f":"IF(COUNTIF(Cert!$E$20:$E$83,Q12)>=1,\"\",ROW())","v":12},"Sculpture",null,"Interactive Media Production Briefs",{"$f":"IF(COUNTIF(Cert!$E$20:$E$83,U12)>=1,\"\",ROW())","v":12},"Interactive Media Production Briefs",null,"Business Online",{"$f":"IF(COUNTIF(Cert!$E$20:$E$83,Y12)>=1,\"\",ROW())","v":12},"Business Online",null,"Exploring Plastering and Dry Lining Principles and Techniques",{"$f":"IF(COUNTIF(Cert!$E$20:$E$83,AC12)>=1,\"\",ROW())","v":12},"Exploring Plastering and Dry Lining Principles and Techniques",null,null,null,null,null,null,null,null,null,null,null,null,null,null,null,null,null,"Menu Planning",{"$f":"IF(COUNTIF(Cert!$E$20:$E$83,AW12)>=1,\"\",ROW())","v":12},"Menu Planning",null,"Installing and Maintaining Computer Hardware",{"$f":"IF(COUNTIF(Cert!$E$20:$E$83,BA12)>=1,\"\",ROW())","v":12},"Installing and Maintaining Computer Hardware",null,"Producing a Music Recording",{"$f":"IF(COUNTIF(Cert!$E$20:$E$83,BE12)>=1,\"\",ROW())","v":12},"Producing a Music Recording",null,"Physical Theatre Performance",{"$f":"IF(COUNTIF(Cert!$E$20:$E$83,BI12)>=1,\"\",ROW())","v":12},"Physical Theatre Performance",null,"Make-up for Performance",{"$f":"IF(COUNTIF(Cert!$E$20:$E$83,BM12)>=1,\"\",ROW())","v":12},"Make-up for Performance",null,null,null,null,null,"Wardrobe for Stage Performance",{"$f":"IF(COUNTIF(Cert!$E$20:$E$83,BU12)>=1,\"\",ROW())","v":12},"Wardrobe for Stage Performance",null,null,null,null,null,"Sound for Performance",{"$f":"IF(COUNTIF(Cert!$E$20:$E$83,CC12)>=1,\"\",ROW())","v":12},"Sound for Performance",null,"Make-up for Performance",{"$f":"IF(COUNTIF(Cert!$E$20:$E$83,CG12)>=1,\"\",ROW())","v":12},"Make-up for Performance",null,null,null,null,null,"Multi-day Expedition Experience",{"$f":"IF(OR(COUNTIF(Cert!$E$20:$E$83,CO12)>=1,COUNTIF(Cert!$E$20:$E$83,CO8)>=1),\"\",ROW())","v":12},"Multi-day Expedition Experience",null,null,null,null,null,"Holiday Representatives",{"$f":"IF(COUNTIF(Cert!$E$20:$E$83,CW12)>=1,\"\",ROW())","v":12},"Holiday Representatives"]
[null,null,null,null,null,null,null,null,null,null,null,null,null,null,null,null,null,null,null,null,"Painting Briefs",{"$f":"IF(COUNTIF(Cert!$E$20:$E$83,U13)>=1,\"\",ROW())","v":13},"Painting Briefs",null,"Public Sector Business",{"$f":"IF(COUNTIF(Cert!$E$20:$E$83,Y13)>=1,\"\",ROW())","v":13},"Public Sector Business",null,"Tendering and Estimating",{"$f":"IF(COUNTIF(Cert!$E$20:$E$83,AC13)>=1,\"\",ROW())","v":13},"Tendering and Estimating",null,null,null,null,null,null,null,null,null,null,null,null,null,null,null,null,null,"Managing Finance in Hospitality",{"$f":"IF(COUNTIF(Cert!$E$20:$E$83,AW13)>=1,\"\",ROW())","v":13},"Managing Finance in Hospitality",null,"Installing and Maintaining Computer Software",{"$f":"IF(COUNTIF(Cert!$E$20:$E$83,BA13)>=1,\"\",ROW())","v":13},"Installing and Maintaining Computer Software",null,"Music Ensemble",{"$f":"IF(COUNTIF(Cert!$E$20:$E$83,BE13)>=1,\"\",ROW())","v":13},"Music Ensemble",null,"Variety Performance",{"$f":"IF(COUNTIF(Cert!$E$20:$E$83,BI13)>=1,\"\",ROW())","v":13},"Variety Performance",null,"Wardrobe for Stage Performance",{"$f":"IF(COUNTIF(Cert!$E$20:$E$83,BM13)>=1,\"\",ROW())","v":13},"Wardrobe for Stage Performance",null,null,null,null,null,"Use of ICT in the Performing Arts",{"$f":"IF(COUNTIF(Cert!$E$20:$E$83,BU13)>=1,\"\",ROW())","v":13},"Use of ICT in the Performing Arts",null,null,null,null,null,"Make-up for Performance",{"$f":"IF(COUNTIF(Cert!$E$20:$E$83,CC13)>=1,\"\",ROW())","v":13},"Make-up for Performance",null,"Wardrobe for Stage Performance",{"$f":"IF(COUNTIF(Cert!$E$20:$E$83,CG13)>=1,\"\",ROW())","v":13},"Wardrobe for Stage Performance",null,null,null,null,null,"Health and Safety in the Public Services",{"$f":"IF(COUNTIF(Cert!$E$20:$E$83,CO13)>=1,\"\",ROW())","v":13},"Health and Safety in the Public Services",null,null,null,null,null,"UK Travel Agency Operations",{"$f":"IF(COUNTIF(Cert!$E$20:$E$83,CW13)>=1,\"\",ROW())","v":13},"UK Travel Agency Operations"]
[null,null,null,null,null,null,null,null,null,null,null,null,null,null,null,null,null,null,null,null,"Practical Research Project in Art and Design",{"$f":"IF(COUNTIF(Cert!$E$20:$E$83,U14)>=1,\"\",ROW())","v":14},"Practical Research Project in Art and Design",null,"Enhancing the Customer Experience",{"$f":"IF(COUNTIF(Cert!$E$20:$E$83,Y14)>=1,\"\",ROW())","v":14},"Enhancing the Customer Experience",null,"Exploring Surveying",{"$f":"IF(COUNTIF(Cert!$E$20:$E$83,AC14)>=1,\"\",ROW())","v":14},"Exploring Surveying",null,null,null,null,null,null,null,null,null,null,null,null,null,null,null,null,null,"Alcohol Awareness in Hospitality",{"$f":"IF(COUNTIF(Cert!$E$20:$E$83,AW14)>=1,\"\",ROW())","v":14},"Alcohol Awareness in Hospitality",null,"Automated Computer Systems",{"$f":"IF(COUNTIF(Cert!$E$20:$E$83,BA14)>=1,\"\",ROW())","v":14},"Automated Computer Systems",null,"Music Showcase",{"$f":"IF(COUNTIF(Cert!$E$20:$E$83,BE14)>=1,\"\",ROW())","v":14},"Music Showcase",null,"Performing Arts Enterprise",{"$f":"IF(COUNTIF(Cert!$E$20:$E$83,BI14)>=1,\"\",ROW())","v":14},"Performing Arts Enterprise",null,"Use of ICT in the Performing Arts",{"$f":"IF(COUNTIF(Cert!$E$20:$E$83,BM14)>=1,\"\",ROW())","v":14},"Use of ICT in the Performing Arts",null,null,null,null,null,"Work Experience in the Performing Arts",{"$f":"IF(COUNTIF(Cert!$E$20:$E$83,BU14)>=1,\"\",ROW())","v":14},"Work Experience in the Performing Arts",null,null,null,null,null,"Wardrobe for Stage Performance",{"$f":"IF(COUNTIF(Cert!$E$20:$E$83,CC14)>=1,\"\",ROW())","v":14},"Wardrobe for Stage Performance",null,"Community Arts",{"$f":"IF(COUNTIF(Cert!$E$20:$E$83,CG14)>=1,\"\",ROW())","v":14},"Community Arts",null,null,null,null,null,"Employability Skills in the Public Services",{"$f":"IF(COUNTIF(Cert!$E$20:$E$83,CO14)>=1,\"\",ROW())","v":14},"Employability Skills in the Public Services",null,null,null,null,null,"The Cruise Industry",{"$f":"IF(COUNTIF(Cert!$E$20:$E$83,CW14)>=1,\"\",ROW())","v":14},"The Cruise Industry"]
[null,null,null,null,null,null,null,null,null,null,null,null,null,null,null,null,null,null,null,null,"Moving Image Briefs",{"$f":"IF(COUNTIF(Cert!$E$20:$E$83,U15)>=1,\"\",ROW())","v":15},"Moving Image Briefs",null,"Visual Merchandising in Retail Business",{"$f":"IF(COUNTIF(Cert!$E$20:$E$83,Y15)>=1,\"\",ROW())","v":15},"Visual Merchandising in Retail Business",null,"Exploring Civil Engineering",{"$f":"IF(COUNTIF(Cert!$E$20:$E$83,AC15)>=1,\"\",ROW())","v":15},"Exploring Civil Engineering",null,null,null,null,null,null,null,null,null,null,null,null,null,null,null,null,null,"Delivering the Hospitality Customer Experience",{"$f":"IF(COUNTIF(Cert!$E$20:$E$83,AW15)>=1,\"\",ROW())","v":15},"Delivering the Hospitality Customer Experience",null,"Multimedia Products Development",{"$f":"IF(COUNTIF(Cert!$E$20:$E$83,BA15)>=1,\"\",ROW())","v":15},"Multimedia Products Development",null,"Researching a Music Topic",{"$f":"IF(COUNTIF(Cert!$E$20:$E$83,BE15)>=1,\"\",ROW())","v":15},"Researching a Music Topic",null,"Singing Skills in the Performing Arts",{"$f":"IF(COUNTIF(Cert!$E$20:$E$83,BI15)>=1,\"\",ROW())","v":15},"Singing Skills in the Performing Arts",null,"Work Experience in the Performing Arts",{"$f":"IF(COUNTIF(Cert!$E$20:$E$83,BM15)>=1,\"\",ROW())","v":15},"Work Experience in the Performing Arts",null,null,null,null,null,null,null,null,null,null,null,null,null,null,null,null,null,"Planning and Managing a Performing Arts Event",{"$f":"IF(COUNTIF(Cert!$E$20:$E$83,CG15)>=1,\"\",ROW())","v":15},"Planning and Managing a Performing Arts Event",null,null,null,null,null,"Preparing to Respond to Emergency Incidents",{"$f":"IF(COUNTIF(Cert!$E$20:$E$83,CO15)>=1,\"\",ROW())","v":15},"Preparing to Respond to Emergency Incidents",null,null,null,null,null,"Hospitality Operations in the Travel and Tourism Sector",{"$f":"IF(COUNTIF(Cert!$E$20:$E$83,CW15)>=1,\"\",ROW())","v":15},"Hospitality Operations in the Travel and Tourism Sector"]
[null,null,null,null,null,null,null,null,null,null,null,null,null,null,null,null,null,null,null,null,"Printmaking Briefs",{"$f":"IF(COUNTIF(Cert!$E$20:$E$83,U16)>=1,\"\",ROW())","v":16},"Printmaking Briefs",null,"Small Business Planning",{"$f":"IF(COUNTIF(Cert!$E$20:$E$83,Y16)>=1,\"\",ROW())","v":16},"Small Business Planning",null,"Exploring Building Services Engineering",{"$f":"IF(COUNTIF(Cert!$E$20:$E$83,AC16)>=1,\"\",ROW())","v":16},"Exploring Building Services Engineering",null,null,null,null,null,null,null,null,null,null,null,null,null,null,null,null,null,"Work Experience in Hospitality",{"$f":"IF(COUNTIF(Cert!$E$20:$E$83,AW16)>=1,\"\",ROW())","v":16},"Work Experience in Hospitality",null,"Computational Thinking",{"$f":"IF(COUNTIF(Cert!$E$20:$E$83,BA16)>=1,\"\",ROW())","v":16},"Computational Thinking",null,"Developing Modern Music Production Skills",{"$f":"IF(COUNTIF(Cert!$E$20:$E$83,BE16)>=1,\"\",ROW())","v":16},"Developing Modern Music Production Skills",null,null,null,null,null,null,null,null,null,null,null,null,null,null,null,null,null,null,null,null,null,null,null,null,null,"Multimedia Production",{"$f":"IF(COUNTIF(Cert!$E$20:$E$83,CG16)>=1,\"\",ROW())","v":16},"Multimedia Production",null,null,null,null,null,"Security Procedures in the Public Services",{"$f":"IF(COUNTIF(Cert!$E$20:$E$83,CO16)>=1,\"\",ROW())","v":16},"Security Procedures in the Public Services",null,null,null,null,null,"UK Visitor Attractions",{"$f":"IF(COUNTIF(Cert!$E$20:$E$83,CW16)>=1,\"\",ROW())","v":16},"UK Visitor Attractions"]
[null,null,null,null,null,null,null,null,null,null,null,null,null,null,null,null,null,null,null,null,"Drawing from Observation",{"$f":"IF(COUNTIF(Cert!$E$20:$E$83,U17)>=1,\"\",ROW())","v":17},"Drawing from Observation",null,"Introducing Project Management",{"$f":"IF(COUNTIF(Cert!$E$20:$E$83,Y17)>=1,\"\",ROW())","v":17},"Introducing Project Management",null,"Exploring Facilities Management",{"$f":"IF(COUNTIF(Cert!$E$20:$E$83,AC17)>=1,\"\",ROW())","v":17},"Exploring Facilities Management",null,null,null,null,null,null,null,null,null,null,null,null,null,null,null,null,null,"Barista Skills in Hospitality",{"$f":"IF(COUNTIF(Cert!$E$20:$E$83,AW17)>=1,\"\",ROW())","v":17},"Barista Skills in Hospitality",null,"Computing in the Workplace",{"$f":"IF(COUNTIF(Cert!$E$20:$E$83,BA17)>=1,\"\",ROW())","v":17},"Computing in the Workplace",null,"Developing Music Theory",{"$f":"IF(COUNTIF(Cert!$E$20:$E$83,BE17)>=1,\"\",ROW())","v":17},"Developing Music Theory",null,null,null,null,null,null,null,null,null,null,null,null,null,null,null,null,null,null,null,null,null,null,null,null,null,"Performing Arts Enterprise",{"$f":"IF(COUNTIF(Cert!$E$20:$E$83,CG17)>=1,\"\",ROW())","v":17},"Performing Arts Enterprise",null,null,null,null,null,"Carrying out a Project in Public Services",{"$f":"IF(COUNTIF(Cert!$E$20:$E$83,CO17)>=1,\"\",ROW())","v":17},"Carrying out a Project in Public Services"]
[null,null,null,null,null,null,null,null,null,null,null,null,null,null,null,null,null,null,null,null,"Ceramics",{"$f":"IF(COUNTIF(Cert!$E$20:$E$83,U18)>=1,\"\",ROW())","v":18},"Ceramics",null,"Delivering and Improving Customer Service",{"$f":"IF(COUNTIF(Cert!$E$20:$E$83,Y18)>=1,\"\",ROW())","v":18},"Delivering and Improving Customer Service",null,null,null,null,null,null,null,null,null,null,null,null,null,null,null,null,null,null,null,null,null,null,null,null,null,"Building a Personal Computer",{"$f":"IF(COUNTIF(Cert!$E$20:$E$83,BA18)>=1,\"\",ROW())","v":18},"Building a Personal Computer",null,"Music Fusion",{"$f":"IF(COUNTIF(Cert!$E$20:$E$83,BE18)>=1,\"\",ROW())","v":18},"Music Fusion",null,null,null,null,null,null,null,null,null,null,null,null,null,null,null,null,null,null,null,null,null,null,null,null,null,"Use of ICT in the Performing Arts",{"$f":"IF(COUNTIF(Cert!$E$20:$E$83,CG18)>=1,\"\",ROW())","v":18},"Use of ICT in the Performing Arts",null,null,null,null,null,"Law and its Impact on the Individual",{"$f":"IF(COUNTIF(Cert!$E$20:$E$83,CO18)>=1,\"\",ROW())","v":18},"Law and its Impact on the Individual"]
[null,null,null,null,null,null,null,null,null,null,null,null,null,null,null,null,null,null,null,null,"Sustainability in Art and Design Practice",{"$f":"IF(COUNTIF(Cert!$E$20:$E$83,U19)>=1,\"\",ROW())","v":19},"Sustainability in Art and Design Practice",null,"Effective Business Communication",{"$f":"IF(COUNTIF(Cert!$E$20:$E$83,Y19)>=1,\"\",ROW())","v":19},"Effective Business Communication",null,null,null,null,null,null,null,null,null,null,null,null,null,null,null,null,null,null,null,null,null,null,null,null,null,"A Technology Business",{"$f":"IF(COUNTIF(Cert!$E$20:$E$83,BA19)>=1,\"\",ROW())","v":19},"A Technology Business",null,"Music Arrangement",{"$f":"IF(COUNTIF(Cert!$E$20:$E$83,BE19)>=1,\"\",ROW())","v":19},"Music Arrangement",null,null,null,null,null,null,null,null,null,null,null,null,null,null,null,null,null,null,null,null,null,null,null,null,null,"Work Experience in the Performing Arts",{"$f":"IF(COUNTIF(Cert!$E$20:$E$83,CG19)>=1,\"\",ROW())","v":19},"Work Experience in the Performing Arts"]
[null,null,null,null,null,null,null,null,null,null,null,null,null,null,null,null,null,null,null,null,"Modelmaking",{"$f":"IF(COUNTIF(Cert!$E$20:$E$83,U20)>=1,\"\",ROW())","v":20},"Modelmaking",null,"Working in Business Teams",{"$f":"IF(COUNTIF(Cert!$E$20:$E$83,Y20)>=1,\"\",ROW())","v":20},"Working in Business Teams",null,null,null,null,null,null,null,null,null,null,null,null,null,null,null,null,null,null,null,null,null,null,null,null,null,"Computer Security in Practice",{"$f":"IF(COUNTIF(Cert!$E$20:$E$83,BA20)>=1,\"\",ROW())","v":20},"Computer Security in Practice",null,"Exploring Music Improvisation",{"$f":"IF(COUNTIF(Cert!$E$20:$E$83,BE20)>=1,\"\",ROW())","v":20},"Exploring Music Improvisation"]
[null,null,null,null,null,null,null,null,null,null,null,null,null,null,null,null,null,null,null,null,"Sculpture",{"$f":"IF(OR(COUNTIF(Cert!$E$20:$E$83,U21)>=1,COUNTIF(Cert!$E$20:$E$83,U2)>=1),\"\",ROW())","v":21},"Sculpture",null,"Planning, Forecasting and Recording Business Finances",{"$f":"IF(COUNTIF(Cert!$E$20:$E$83,Y21)>=1,\"\",ROW())","v":21},"Planning, Forecasting and Recording Business Finances",null,null,null,null,null,null,null,null,null,null,null,null,null,null,null,null,null,null,null,null,null,null,null,null,null,"Computer Systems Support in Practice",{"$f":"IF(COUNTIF(Cert!$E$20:$E$83,BA21)>=1,\"\",ROW())","v":21},"Computer Systems Support in Practice",null,"Exploring DJing",{"$f":"IF(COUNTIF(Cert!$E$20:$E$83,BE21)>=1,\"\",ROW())","v":21},"Exploring DJing"]
[null,null,null,null,null,null,null,null,null,null,null,null,null,null,null,null,null,null,null,null,null,null,null,null,"Work Experience in Business",{"$f":"IF(OR(COUNTIF(Cert!$E$20:$E$83,Y7)>=1,COUNTIF(Cert!$E$20:$E$83,Y22)>=1),\"\",ROW())","v":22},"Work Experience in Business",null,null,null,null,null,null,null,null,null,null,null,null,null,null,null,null,null,null,null,null,null,null,null,null,null,"Software Systems Development",{"$f":"IF(COUNTIF(Cert!$E$20:$E$83,BA22)>=1,\"\",ROW())","v":22},"Software Systems Development",null,"Music Promotion",{"$f":"IF(COUNTIF(Cert!$E$20:$E$83,BE22)>=1,\"\",ROW())","v":22},"Music Promotion"]
[null,null,null,null,null,null,null,null,null,null,null,null,null,null,null,null,null,null,null,null,null,null,null,null,"Introducing International Business",{"$f":"IF(COUNTIF(Cert!$E$20:$E$83,Y23)>=1,\"\",ROW())","v":23},"Introducing International Business",null,null,null,null,null,null,null,null,null,null,null,null,null,null,null,null,null,null,null,null,null,null,null,null,null,"IT Work Experience",{"$f":"IF(COUNTIF(Cert!$E$20:$E$83,BA23)>=1,\"\",ROW())","v":23},"IT Work Experience",null,"Digital and Mobile Technology for Music",{"$f":"IF(COUNTIF(Cert!$E$20:$E$83,BE23)>=1,\"\",ROW())","v":23},"Digital and Mobile Technology for Music"]
[null,null,null,null,null,null,null,null,null,null,null,null,null,null,null,null,null,null,null,null,null,null,null,null,"Introducing the Economic Environment",{"$f":"IF(COUNTIF(Cert!$E$20:$E$83,Y24)>=1,\"\",ROW())","v":24},"Introducing the Economic Environment",null,null,null,null,null,null,null,null,null,null,null,null,null,null,null,null,null,null,null,null,null,null,null,null,null,null,null,null,null,"Composing for Visual Media",{"$f":"IF(COUNTIF(Cert!$E$20:$E$83,BE24)>=1,\"\",ROW())","v":24},"Composing for Visual Media"]
[null,null,null,null,null,null,null,null,null,null,null,null,null,null,null,null,null,null,null,null,null,null,null,null,"Efficient Business Operations",{"$f":"IF(COUNTIF(Cert!$E$20:$E$83,Y25)>=1,\"\",ROW())","v":25},"Efficient Business Operations",null,null,null,null,null,null,null,null,null,null,null,null,null,null,null,null,null,null,null,null,null,null,null,null,null,null,null,null,null,"Enterprise and Music",{"$f":"IF(COUNTIF(Cert!$E$20:$E$83,BE25)>=1,\"\",ROW())","v":25},"Enterprise and Music"]
[null,null,null,null,null,null,null,null,null,null,null,null,null,null,null,null,null,null,null,null,null,null,null,null,"Principles of Procurement and Supply",{"$f":"IF(COUNTIF(Cert!$E$20:$E$83,Y26)>=1,\"\",ROW())","v":26},"Principles of Procurement and Supply",null,null,null,null,null,null,null,null,null,null,null,null,null,null,null,null,null,null,null,null,null,null,null,null,null,null,null,null,null,"Professional Skills in Music",{"$f":"IF(COUNTIF(Cert!$E$20:$E$83,BE26)>=1,\"\",ROW())","v":26},"Professional Skills in Music"]
[null,null,null,null,null,null,null,null,null,null,null,null,null,null,null,null,null,null,null,null,null,null,null,null,"Implementing Procurement and Supply in Business",{"$f":"IF(COUNTIF(Cert!$E$20:$E$83,Y27)>=1,\"\",ROW())","v":27},"Implementing Procurement and Supply in Business"]
[null,null,null,null,null,null,null,null,null,null,null,null,null,null,null,null,null,null,null,null,null,null,null,null,"Corporate Social Responsibility",{"$f":"IF(COUNTIF(Cert!$E$20:$E$83,Y28)>=1,\"\",ROW())","v":28},"Corporate Social Responsibility"]
[null,null,null,null,null,null,null,null,null,null,null,null,null,null,null,null,null,null,null,null,null,null,null,null,"Managing Personal Finances",{"$f":"IF(COUNTIF(Cert!$E$20:$E$83,Y29)>=1,\"\",ROW())","v":29},"Managing Personal Finances"]
[null,null,null,null,null,null,null,null,null,null,null,null,null,null,null,null,null,null,null,null,null,null,null,null,"Sustainability in the Business Workplace",{"$f":"IF(COUNTIF(Cert!$E$20:$E$83,Y30)>=1,\"\",ROW())","v":30},"Sustainability in the Business Workplace"]
[]
[]
[]
[]
[]
[]
[]
[]
[null,null,null,null,null,null,null,null,null,null,null,null,null,null,null,null,null,null,null,null,null,null,null,null,null,null,null,null,null,null,null,null,null,null,null,null,null,null,null,null,null,null,null,null,null,null,null,null,"Unit 6",null,"Unit 13","Forbidden"]
[null,null,null,null,null,null,null,null,null,null,null,null,null,null,null,null,null,null,null,null,null,null,null,null,null,null,null,null,null,null,null,null,null,null,null,null,null,null,null,null,null,null,null,null,null,null,null,null,{"$f":"COUNTIF(Cert!$E$20:$E$27, \"Planning, Preparing, Cooking and Finishing Food\")","v":0},null,{"$f":"COUNTIF(Cert!$E$20:$E$27, \"Contemporary World Food Cooking Skills\")","v":0},{"$f":"IF(AND(AW40=0,AY40=1),1,0)","v":0}]
[null,null,null,null,null,null,null,null,null,null,null,null,null,null,null,null,null,null,null,null,null,null,null,null,null,null,null,null,null,null,null,null,null,null,null,null,null,null,null,null,null,null,null,null,null,null,null,null,"Unit 4",null,"Unit 16","Forbidden"]
[null,null,null,null,null,null,null,null,null,null,null,null,null,null,null,null,null,null,null,null,null,null,null,null,null,null,null,null,null,null,null,null,null,null,null,null,null,null,null,null,null,null,null,null,null,null,null,null,{"$f":"COUNTIF(Cert!$E$20:$E$27, \"Costing and Controlling Finances in the Hospitality Industry\")","v":0},null,{"$f":"COUNTIF(Cert!$E$20:$E$27, \"Managing Finance in Hospitality\")","v":0},{"$f":"IF(AND(AW42=0,AY42=1),1,0)","v":0}]

{"sheet":"Diploma Data Sheet","index":9,"n_rows":385,"n_cols":19,"rows_kept":385,"cut":false,"hidden":true,"merged":[]}
["Mandatory units",null,null,null,null,null,null,"optional Units A",null,null,null,null,null,null,"optional Units B"]
["Sector","Unit number","Unit Name","GLH","Assessment type",null,null,"Sector","Unit Number","Unit Name","GLH","Assessment type",null,null,"Sector","Unit Number","Unit Name","GLH","Assessment type"]
["Applied Science",1,"Principles of Science",30,"External",null,"Practical Scientific Project","Applied Science",9,"Practical Scientific Project",30,"Internal",null,"Engineering Maintenance","Engineering",4,"Engineering Maintenance",30,"Internal"]
["Applied Science",2,"Chemistry and our Earth",30,"Internal",null,"World Energy","Applied Science",10,"World Energy",30,"Internal",null,"Computer-aided Engineering","Engineering",6,"Computer-aided Engineering",30,"Internal"]
["Applied Science",3,"Energy and our Universe",30,"Internal",null,"How Scientific Theories are Formulated","Applied Science",11,"How Scientific Theories are Formulated",30,"Internal",null,"Electrical and Mechanical Science for Engineering","Engineering",11,"Electrical and Mechanical Science for Engineering",30,"Internal"]
["Applied Science",4,"Biology and our Environment",30,"Internal",null,"The Living Body","Applied Science",12,"The Living Body",30,"Internal",null,"Engineering Assembly","Engineering",13,"Engineering Assembly",30,"Internal"]
["Applied Science",5,"Applications of Chemical Substances",30,"Internal",null,"Monitoring the Environment","Applied Science",13,"Monitoring the Environment",30,"Internal",null,"Vehicle Engines and Other Systems","Engineering",14,"Vehicle Engines and Other Systems",30,"Internal"]
["Applied Science",6,"Applications of Physical Science",30,"Internal",null,"Growing Plants for Food","Applied Science",14,"Growing Plants for Food",30,"Internal",null,"Vehicle Electrical Sytems","Engineering",16,"Vehicle Electrical Sytems",30,"Internal"]
["Applied Science",7,"Health Applications of Life Science",30,"Internal",null,"Investigating a Crime Scene","Applied Science",15,"Investigating a Crime Scene",30,"Internal",null,"Welding","Engineering",17,"Welding",60,"Internal"]
["Applied Science",8,"Scientific Skills",30,"External",null,"Science in Medicine","Applied Science",16,"Science in Medicine",30,"Internal",null,"Bicycle Servicing and Maintenance","Engineering",19,"Bicycle Servicing and Maintenance",30,"Internal"]
["Art and Design",1,"Introduction to Specialist Pathways in Art and Design",30,"Internal",null,"Understanding Human Behaviour","Applied Science",17,"Understanding Human Behaviour",30,"Internal",null,"Sustainable Vehicle Power and Structure Design","Engineering",20,"Sustainable Vehicle Power and Structure Design",60,"Internal"]
["Art and Design",2,"Creative Project in Art and Design",30,"External",null,"Designing and Making Useful Devices in Science","Applied Science",18,"Designing and Making Useful Devices in Science",30,"Internal",null,"Continuous Improvement and Problem-Solving","Engineering",22,"Continuous Improvement and Problem-Solving",60,"Internal"]
["Art and Design",5,"Developing an Art and Design Portfolio",30,"Internal",null,"Chemical Analysis and Detection","Applied Science",19,"Chemical Analysis and Detection",30,"Internal",null,"Electronic Devices and Communication Applications","Engineering",23,"Electronic Devices and Communication Applications",60,"Internal"]
["Art and Design",6,"Investigating Contextual References in Art and Design",30,"Internal",null,"Exploring our Universe","Applied Science",20,"Exploring our Universe",30,"Internal",null,"Operation and Maintenance of Mechanical Systems and Components","Engineering",24,"Operation and Maintenance of Mechanical Systems and Components",60,"Internal"]
["Art and Design",7,"Recording for Creative Intentions in Art and Design",30,"External",null,"Electronics in Action","Applied Science",21,"Electronics in Action",30,"Internal",null,"Operation and Maintenance of Electronic Systems and Components","Engineering",25,"Operation and Maintenance of Electronic Systems and Components",60,"Internal"]
["Art and Design",16,"Applying Contextual References in Art and Design",30,"Internal",null,"Biotechnology Procedures and Applications","Applied Science",22,"Biotechnology Procedures and Applications",30,"Internal",null,"Operation and Maintenance of Electrical Systems and Components","Engineering",26,"Operation and Maintenance of Electrical Systems and Components",60,"Internal"]
["Art and Design",23,"Practical Research Project in Art and Design",60,"Internal",null,"Further Chemistry","Applied Science",23,"Further Chemistry",30,"Internal",null,"Operation and Maintenance of Fluid Power Systems and Components","Engineering",27,"Operation and Maintenance of Fluid Power Systems and Components",60,"Internal"]
["Art and Design Design Crafts",1,"Introduction to Specialist Pathways in Art and Design",30,"Internal",null,"Further Physics","Applied Science",24,"Further Physics",30,"Internal",null,"Fabrication Techniques","Engineering",28,"Fabrication Techniques",60,"Internal"]
["Art and Design Design Crafts",2,"Creative Project in Art and Design",30,"External",null,"Communicating Ideas in 2D","Art and Design",3,"Communicating Ideas in 2D",30,"Internal",null,"Casting Techniques","Engineering",29,"Casting Techniques",60,"Internal"]
["Art and Design Design Crafts",5,"Developing an Art and Design Portfolio",30,"Internal",null,"Communicating Ideas in 3D","Art and Design",4,"Communicating Ideas in 3D",30,"Internal",null,"Vehicle Maintenance Techniques","Engineering",30,"Vehicle Maintenance Techniques",60,"Internal"]
["Art and Design Design Crafts",6,"Investigating Contextual References in Art and Design",30,"Internal",null,"Using Mobile Devices in Art and Design","Art and Design",8,"Using Mobile Devices in Art and Design",30,"Internal",null,"Production Planning for Engineering","Engineering",31,"Production Planning for Engineering",30,"Internal"]
["Art and Design Design Crafts",7,"Recording for Creative Intentions in Art and Design",30,"External",null,"Design Crafts Briefs","Art and Design",9,"Design Crafts Briefs",60,"Internal",null,"Engineering Marking Out","Engineering",32,"Engineering Marking Out",30,"Internal"]
["Art and Design Design Crafts",9,"Design Crafts Briefs",60,"Internal",null,"Fashion Briefs","Art and Design",10,"Fashion Briefs",60,"Internal",null,"Preparing and Controlling Engineering Manufacturing Operations","Engineering",33,"Preparing and Controlling Engineering Manufacturing Operations",30,"Internal"]
["Art and Design Design Crafts",16,"Applying Contextual References in Art and Design",30,"Internal",null,"Graphic Design Briefs","Art and Design",11,"Graphic Design Briefs",60,"Internal",null,"PC Software and Hardware in Engineering","Engineering",34,"PC Software and Hardware in Engineering",60,"Internal"]
["Art and Design Design Crafts",23,"Practical Research Project in Art and Design",60,"Internal",null,"Textiles Briefs","Art and Design",12,"Textiles Briefs",60,"Internal",null,"Application of Quality Control and Measurement in Engineering","Engineering",35,"Application of Quality Control and Measurement in Engineering",60,"Internal"]
["Art and Design Fashion and Textiles",1,"Introduction to Specialist Pathways in Art and Design",30,"Internal",null,"Visual Arts Briefs","Art and Design",13,"Visual Arts Briefs",60,"Internal",null,"Engineering Maintenance","Engineering Technology",4,"Engineering Maintenance",30,"Internal"]
["Art and Design Fashion and Textiles",2,"Creative Project in Art and Design",30,"External",null,"Photography Briefs","Art and Design",14,"Photography Briefs",60,"Internal",null,"Computer-aided Engineering","Engineering Technology",6,"Computer-aided Engineering",30,"Internal"]
["Art and Design Fashion and Textiles",5,"Developing an Art and Design Portfolio",30,"Internal",null,"Designing for the Future","Art and Design",15,"Designing for the Future",60,"Internal",null,"Electronic Circuit Design and Construction","Engineering Technology",8,"Electronic Circuit Design and Construction",60,"Internal"]
["Art and Design Fashion and Textiles",6,"Investigating Contextual References in Art and Design",30,"Internal",null,"Art, Craft and Design in the Creative Industries","Art and Design",17,"Art, Craft and Design in the Creative Industries",30,"Internal",null,"Electrical and Mechanical Science for Engineering","Engineering Technology",11,"Electrical and Mechanical Science for Engineering",30,"Internal"]
["Art and Design Fashion and Textiles",7,"Recording for Creative Intentions in Art and Design",30,"External",null,"3D Design Briefs","Art and Design",18,"3D Design Briefs",60,"Internal",null,"Engineering Design","Engineering Technology",12,"Engineering Design",60,"Internal"]
["Art and Design Fashion and Textiles",10,"Fashion Briefs",60,"Internal",null,"Digital Art and Design Briefs","Art and Design",19,"Digital Art and Design Briefs",60,"Internal",null,"Computer Numerical Control Programming","Engineering Technology",18,"Computer Numerical Control Programming",60,"Internal"]
["Art and Design Fashion and Textiles",12,"Textiles Briefs",60,"Internal",null,"Interactive Media Production Briefs","Art and Design",20,"Interactive Media Production Briefs",60,"Internal",null,"Sustainable Vehicle Power and Structure Design","Engineering Technology",20,"Sustainable Vehicle Power and Structure Design",60,"Internal"]
["Art and Design Fashion and Textiles",16,"Applying Contextual References in Art and Design",30,"Internal",null,"Painting Briefs","Art and Design",21,"Painting Briefs",60,"Internal",null,"Electronic Circuit Design and Construction","Engineering Maintenance",8,"Electronic Circuit Design and Construction",60,"Internal"]
["Art and Design Fashion and Textiles",23,"Practical Research Project in Art and Design",60,"Internal",null,"Designing Products","Art and Design",22,"Designing Products",60,"Internal",null,"Electrical and Mechanical Science for Engineering","Engineering Maintenance",11,"Electrical and Mechanical Science for Engineering",30,"Internal"]
["Art and Design Photography",1,"Introduction to Specialist Pathways in Art and Design",30,"Internal",null,"Design Thinking","Art and Design",24,"Design Thinking",60,"Internal",null,"Engineering Assembly","Engineering Maintenance",13,"Engineering Assembly",30,"Internal"]
["Art and Design Photography",2,"Creative Project in Art and Design",30,"External",null,"Fashion Promotion","Art and Design",25,"Fashion Promotion",60,"Internal",null,"Vehicle Engines and Other Systems","Engineering Maintenance",14,"Vehicle Engines and Other Systems",30,"Internal"]
["Art and Design Photography",5,"Developing an Art and Design Portfolio",30,"Internal",null,"Moving Image Briefs","Art and Design",26,"Moving Image Briefs",60,"Internal",null,"Bicycle Servicing and Maintenance","Engineering Maintenance",19,"Bicycle Servicing and Maintenance",30,"Internal"]
["Art and Design Photography",6,"Investigating Contextual References in Art and Design",30,"Internal",null,"Interaction Design","Art and Design",27,"Interaction Design",60,"Internal",null,"Electronic Devices and Communication Applications","Engineering Maintenance",23,"Electronic Devices and Communication Applications",60,"Internal"]
["Art and Design Photography",7,"Recording for Creative Intentions in Art and Design",30,"External",null,"Printmaking Briefs","Art and Design",28,"Printmaking Briefs",60,"Internal",null,"Vehicle Maintenance Techniques","Engineering Maintenance",30,"Vehicle Maintenance Techniques",60,"Internal"]
["Art and Design Photography",14,"Photography Briefs",60,"Internal",null,"Drawing from Observation","Art and Design",29,"Drawing from Observation",60,"Internal",null,"Engineering Maintenance","Engineering Manufacturing",4,"Engineering Maintenance",30,"Internal"]
["Art and Design Photography",16,"Applying Contextual References in Art and Design",30,"Internal",null,"Ceramics","Art and Design",30,"Ceramics",60,"Internal",null,"Computer-aided Engineering","Engineering Manufacturing",6,"Computer-aided Engineering",30,"Internal"]
["Art and Design Photography",23,"Practical Research Project in Art and Design",60,"Internal",null,"Studio Photography","Art and Design",31,"Studio Photography",60,"Internal",null,"Machining Techniques","Engineering Manufacturing",7,"Machining Techniques",60,"Internal"]
["Art and Design Product Design",1,"Introduction to Specialist Pathways in Art and Design",30,"Internal",null,"Location Photography","Art and Design",32,"Location Photography",60,"Internal",null,"Electrical and Mechanical Science for Engineering","Engineering Manufacturing",11,"Electrical and Mechanical Science for Engineering",30,"Internal"]
["Art and Design Product Design",2,"Creative Project in Art and Design",30,"External",null,"Designing for Print and Screen","Art and Design",33,"Designing for Print and Screen",60,"Internal",null,"Engineering Design","Engineering Manufacturing",12,"Engineering Design",60,"Internal"]
["Art and Design Product Design",5,"Developing an Art and Design Portfolio",30,"Internal",null,"Editing Photographic Images","Art and Design",34,"Editing Photographic Images",60,"Internal",null,"Engineering Assembly","Engineering Manufacturing",13,"Engineering Assembly",30,"Internal"]
["Art and Design Product Design",6,"Investigating Contextual References in Art and Design",30,"Internal",null,"Fashion Retail","Art and Design",35,"Fashion Retail",60,"Internal",null,"Welding","Engineering Manufacturing",17,"Welding",60,"Internal"]
["Art and Design Product Design",7,"Recording for Creative Intentions in Art and Design",30,"External",null,"Surface Design","Art and Design",36,"Surface Design",60,"Internal",null,"Computer Numerical Control Programming","Engineering Manufacturing",18,"Computer Numerical Control Programming",60,"Internal"]
["Art and Design Product Design",15,"Designing for the Future",60,"Internal",null,"Sustainability in Art and Design Practice","Art and Design",37,"Sustainability in Art and Design Practice",30,"Internal",null,"Fabrication Techniques","Engineering Manufacturing",28,"Fabrication Techniques",60,"Internal"]
["Art and Design Product Design",16,"Applying Contextual References in Art and Design",30,"Internal",null,"Advertising Briefs","Art and Design",38,"Advertising Briefs",60,"Internal",null,"Casting Techniques","Engineering Manufacturing",29,"Casting Techniques",60,"Internal"]
["Art and Design Product Design",23,"Practical Research Project in Art and Design",60,"Internal",null,"Modelmaking","Art and Design",39,"Modelmaking",60,"Internal",null,"Production Planning for Engineering","Engineering Manufacturing",31,"Production Planning for Engineering",30,"Internal"]
["Art and Design Visual Arts",1,"Introduction to Specialist Pathways in Art and Design",30,"Internal",null,"Sculpture","Art and Design",40,"Sculpture",60,"Internal",null,"Application of Quality Control and Measurement in Engineering","Engineering Manufacturing",35,"Application of Quality Control and Measurement in Engineering",60,"Internal"]
["Art and Design Visual Arts",2,"Creative Project in Art and Design",30,"External",null,"Communicating Ideas in 2D","Art and Design Design Crafts",3,"Communicating Ideas in 2D",30,"Internal",null,"Engineering Maintenance","Engineering Mechanical",4,"Engineering Maintenance",30,"Internal"]
["Art and Design Visual Arts",5,"Developing an Art and Design Portfolio",30,"Internal",null,"Art, Craft and Design in the Creative Industries","Art and Design Design Crafts",17,"Art, Craft and Design in the Creative Industries",30,"Internal",null,"Computer-aided Engineering","Engineering Mechanical",6,"Computer-aided Engineering",30,"Internal"]
["Art and Design Visual Arts",6,"Investigating Contextual References in Art and Design",30,"Internal",null,"3D Design Briefs","Art and Design Design Crafts",18,"3D Design Briefs",60,"Internal",null,"Electrical and Mechanical Science for Engineering","Engineering Mechanical",11,"Electrical and Mechanical Science for Engineering",30,"Internal"]
["Art and Design Visual Arts",7,"Recording for Creative Intentions in Art and Design",30,"External",null,"Designing Products","Art and Design Design Crafts",22,"Designing Products",60,"Internal",null,"Engineering Design","Engineering Mechanical",12,"Engineering Design",60,"Internal"]
["Art and Design Visual Arts",13,"Visual Arts Briefs",60,"Internal",null,"Printmaking Briefs","Art and Design Design Crafts",28,"Printmaking Briefs",60,"Internal",null,"Engineering Assembly","Engineering Mechanical",13,"Engineering Assembly",30,"Internal"]
["Art and Design Visual Arts",16,"Applying Contextual References in Art and Design",30,"Internal",null,"Drawing from Observation","Art and Design Design Crafts",29,"Drawing from Observation",60,"Internal",null,"Vehicle Engines and Other Systems","Engineering Mechanical",14,"Vehicle Engines and Other Systems",30,"Internal"]
["Art and Design Visual Arts",23,"Practical Research Project in Art and Design",60,"Internal",null,"Ceramics","Art and Design Design Crafts",30,"Ceramics",60,"Internal",null,"Welding","Engineering Mechanical",17,"Welding",60,"Internal"]
["Art and Design Visual Communication",1,"Introduction to Specialist Pathways in Art and Design",30,"Internal",null,"Surface Design","Art and Design Design Crafts",36,"Surface Design",60,"Internal",null,"Computer Numerical Control Programming","Engineering Mechanical",18,"Computer Numerical Control Programming",60,"Internal"]
["Art and Design Visual Communication",2,"Creative Project in Art and Design",30,"External",null,"Sustainability in Art and Design Practice","Art and Design Design Crafts",37,"Sustainability in Art and Design Practice",30,"Internal",null,"Production Planning for Engineering","Engineering Mechanical",31,"Production Planning for Engineering",30,"Internal"]
["Art and Design Visual Communication",5,"Developing an Art and Design Portfolio",30,"Internal",null,"Modelmaking","Art and Design Design Crafts",39,"Modelmaking",60,"Internal",null,"Engineering Marking Out","Engineering Mechanical",32,"Engineering Marking Out",30,"Internal"]
["Art and Design Visual Communication",6,"Investigating Contextual References in Art and Design",30,"Internal",null,"Sculpture","Art and Design Design Crafts",40,"Sculpture",60,"Internal",null,"Application of Quality Control and Measurement in Engineering","Engineering Mechanical",35,"Application of Quality Control and Measurement in Engineering",60,"Internal"]
["Art and Design Visual Communication",7,"Recording for Creative Intentions in Art and Design",30,"External",null,"Communicating Ideas in 2D","Art and Design Fashion and Textiles",3,"Communicating Ideas in 2D",30,"Internal",null,"Social Influences on Health and Wellbeing","Health and Social Care",4,"Social Influences on Health and Wellbeing",30,"Internal"]
["Art and Design Visual Communication",11,"Graphic Design Briefs",60,"Internal",null,"Design Crafts Briefs","Art and Design Fashion and Textiles",9,"Design Crafts Briefs",60,"Internal",null,"Promoting Health and Wellbeing","Health and Social Care",5,"Promoting Health and Wellbeing",30,"Internal"]
["Art and Design Visual Communication",16,"Applying Contextual References in Art and Design",30,"Internal",null,"Photography Briefs","Art and Design Fashion and Textiles",14,"Photography Briefs",60,"Internal",null,"The Impact of Nutrition on Health and Wellbeing","Health and Social Care",6,"The Impact of Nutrition on Health and Wellbeing",30,"Internal"]
["Art and Design Visual Communication",23,"Practical Research Project in Art and Design",60,"Internal",null,"Designing for the Future","Art and Design Fashion and Textiles",15,"Designing for the Future",60,"Internal",null,"Services in Health and Social Care","Health and Social Care",11,"Services in Health and Social Care",30,"Internal"]
["Business",1,"Enterprise in the Business World",30,"Internal",null,"Art, Craft and Design in the Creative Industries","Art and Design Fashion and Textiles",17,"Art, Craft and Design in the Creative Industries",30,"Internal",null,"An Introduction to Basic First Aid","Health and Social Care",22,"An Introduction to Basic First Aid",30,"Internal"]
["Business",2,"Finance for Business",30,"External",null,"Designing Products","Art and Design Fashion and Textiles",22,"Designing Products",60,"Internal",null,"Food Safety in Health and Social Care","Health and Social Care",23,"Food Safety in Health and Social Care",30,"Internal"]
["Business",3,"Promoting a Brand",30,"Internal",null,"Fashion Promotion","Art and Design Fashion and Textiles",25,"Fashion Promotion",60,"Internal",null,"Infection Control in Health and Social Care","Health and Social Care",24,"Infection Control in Health and Social Care",30,"Internal"]
["Business",9,"Principles of Marketing",30,"External",null,"Printmaking Briefs","Art and Design Fashion and Textiles",28,"Printmaking Briefs",60,"Internal",null,"Using ICT in Health and Social Care","Health and Social Care",25,"Using ICT in Health and Social Care",30,"Internal"]
["Business",18,"Small Business Planning",60,"Internal",null,"Drawing from Observation","Art and Design Fashion and Textiles",29,"Drawing from Observation",60,"Internal",null,"Creating Digital Animation","Information and Creative Technology",4,"Creating Digital Animation",30,"Internal"]
["Business",19,"Introducing Project Management",60,"Internal",null,"Designing for Print and Screen","Art and Design Fashion and Textiles",33,"Designing for Print and Screen",60,"Internal",null,"Creating Digital Audio","Information and Creative Technology",5,"Creating Digital Audio",30,"Internal"]
["Construction and the Built Environment",1,"Construction Technology",30,"External",null,"Fashion Retail","Art and Design Fashion and Textiles",35,"Fashion Retail",60,"Internal",null,"Creating Digital Graphics","Information and Creative Technology",6,"Creating Digital Graphics",30,"Internal"]
["Construction and the Built Environment",2,"Construction and Design",30,"Internal",null,"Surface Design","Art and Design Fashion and Textiles",36,"Surface Design",60,"Internal",null,"Creating Digital Video","Information and Creative Technology",7,"Creating Digital Video",30,"Internal"]
["Construction and the Built Environment",3,"Scientific and Mathematical Applications for Construction",30,"Internal",null,"Sustainability in Art and Design Practice","Art and Design Fashion and Textiles",37,"Sustainability in Art and Design Practice",30,"Internal",null,"Mobile Apps Development","Information and Creative Technology",8,"Mobile Apps Development",30,"Internal"]
["Construction and the Built Environment",4,"Construction Processes and Operations",30,"Internal",null,"Communicating Ideas in 2D","Art and Design Photography",3,"Communicating Ideas in 2D",30,"Internal",null,"Spreadsheet Development","Information and Creative Technology",9,"Spreadsheet Development",30,"Internal"]
["Construction and the Built Environment",11,"Sustainability in Construction",30,"External",null,"Communicating Ideas in 3D","Art and Design Photography",4,"Communicating Ideas in 3D",30,"Internal",null,"Building a Personal Computer","Information and Creative Technology",20,"Building a Personal Computer",30,"Internal"]
["Construction and the Built Environment",12,"Sustainability in Construction",30,"Internal",null,"Using Mobile Devices in Art and Design","Art and Design Photography",8,"Using Mobile Devices in Art and Design",30,"Internal",null,"IT Work Experience","Information and Creative Technology",25,"IT Work Experience",30,"Internal"]
["Construction and the Built Environment",21,"Maintenance and Adaptation of Buildings",60,"Internal",null,"Art, Craft and Design in the Creative Industries","Art and Design Photography",17,"Art, Craft and Design in the Creative Industries",30,"Internal",null,"Movement Skills","Performing Arts",10,"Movement Skills",30,"Internal"]
["Creative Digital Media Production",1,"Digital Media Sectors and Audiences",30,"External",null,"Digital Art and Design Briefs","Art and Design Photography",19,"Digital Art and Design Briefs",60,"Internal",null,"Devising Performance Work","Performing Arts",11,"Devising Performance Work",30,"Internal"]
["Creative Digital Media Production",2,"Planning and Pitching a Digital Media Product",30,"Internal",null,"Moving Image Briefs","Art and Design Photography",26,"Moving Image Briefs",60,"Internal",null,"Exploring Improvisation","Performing Arts",12,"Exploring Improvisation",30,"Internal"]
["Creative Digital Media Production",8,"Media Industry in Context",30,"External",null,"Studio Photography","Art and Design Photography",31,"Studio Photography",60,"Internal",null,"Multimedia Performance","Performing Arts",13,"Multimedia Performance",30,"Internal"]
["Creative Digital Media Production",21,"Deconstructing Media Products",60,"Internal",null,"Location Photography","Art and Design Photography",32,"Location Photography",60,"Internal",null,"Voice and Speech for Performers","Performing Arts",14,"Voice and Speech for Performers",30,"Internal"]
["Creative Digital Media Production",22,"Final Digital Production Project",60,"Internal",null,"Designing for Print and Screen","Art and Design Photography",33,"Designing for Print and Screen",60,"Internal",null,"Performing Scripted Plays","Performing Arts",15,"Performing Scripted Plays",30,"Internal"]
["Engineering",1,"The Engineered World",30,"External",null,"Editing Photographic Images","Art and Design Photography",34,"Editing Photographic Images",60,"Internal",null,"Contemporary Dance Techniques","Performing Arts",16,"Contemporary Dance Techniques",30,"Internal"]
["Engineering",2,"Investigating an Engineered Product",30,"Internal",null,"Sustainability in Art and Design Practice","Art and Design Photography",37,"Sustainability in Art and Design Practice",30,"Internal",null,"Exploring Urban Dance Styles","Performing Arts",17,"Exploring Urban Dance Styles",30,"Internal"]
["Engineering",3,"Health and Safety in Engineering",30,"Internal",null,"Communicating Ideas in 2D","Art and Design Product Design",3,"Communicating Ideas in 2D",30,"Internal",null,"Jazz Dance Techniques","Performing Arts",18,"Jazz Dance Techniques",30,"Internal"]
["Engineering",5,"Engineering Materials",30,"Internal",null,"Communicating Ideas in 3D","Art and Design Product Design",4,"Communicating Ideas in 3D",30,"Internal",null,"Design Planning for Performance","Performing Arts",19,"Design Planning for Performance",30,"Internal"]
["Engineering",9,"Interpreting and Using Engineering Information",30,"External",null,"Using Mobile Devices in Art and Design","Art and Design Product Design",8,"Using Mobile Devices in Art and Design",30,"Internal",null,"Realising Costume Design for Performance","Performing Arts",20,"Realising Costume Design for Performance",30,"Internal"]
["Engineering",10,"Mathematics for Engineering",30,"Internal",null,"Fashion Briefs","Art and Design Product Design",10,"Fashion Briefs",60,"Internal",null,"Realising Set Design for Performance","Performing Arts",21,"Realising Set Design for Performance",30,"Internal"]
["Engineering",21,"Introduction to Communications for Engineering",60,"Internal",null,"Graphic Design Briefs","Art and Design Product Design",11,"Graphic Design Briefs",60,"Internal",null,"Realising Prop Design for Performance","Performing Arts",22,"Realising Prop Design for Performance",30,"Internal"]
["Engineering Technology",1,"The Engineered World",30,"External",null,"Textiles Briefs","Art and Design Product Design",12,"Textiles Briefs",60,"Internal",null,"Realising Mask Design for Performance","Performing Arts",23,"Realising Mask Design for Performance",30,"Internal"]
["Engineering Technology",2,"Investigating an Engineered Product",30,"Internal",null,"Art, Craft and Design in the Creative Industries","Art and Design Product Design",17,"Art, Craft and Design in the Creative Industries",30,"Internal",null,"Lighting for Performance","Performing Arts",24,"Lighting for Performance",30,"Internal"]
["Engineering Technology",3,"Health and Safety in Engineering",30,"Internal",null,"3D Design Briefs","Art and Design Product Design",18,"3D Design Briefs",60,"Internal",null,"Sound for Performance","Performing Arts",25,"Sound for Performance",30,"Internal"]
["Engineering Technology",5,"Engineering Materials",30,"Internal",null,"Digital Art and Design Briefs","Art and Design Product Design",19,"Digital Art and Design Briefs",60,"Internal",null,"Supporting Performance: Stage Management","Performing Arts",26,"Supporting Performance: Stage Management",30,"Internal"]
["Engineering Technology",9,"Interpreting and Using Engineering Information",30,"External",null,"Interactive Media Production Briefs","Art and Design Product Design",20,"Interactive Media Production Briefs",60,"Internal",null,"Supporting Performance: Front of House","Performing Arts",27,"Supporting Performance: Front of House",30,"Internal"]
["Engineering Technology",10,"Mathematics for Engineering",30,"Internal",null,"Designing Products","Art and Design Product Design",22,"Designing Products",60,"Internal",null,"Make-up for Performance","Performing Arts",28,"Make-up for Performance",30,"Internal"]
["Engineering Technology",21,"Introduction to Communications for Engineering",60,"Internal",null,"Design Thinking","Art and Design Product Design",24,"Design Thinking",60,"Internal",null,"Wardrobe for Stage Performance","Performing Arts",29,"Wardrobe for Stage Performance",30,"Internal"]
["Engineering Maintenance",1,"The Engineered World",30,"External",null,"Moving Image Briefs","Art and Design Product Design",26,"Moving Image Briefs",60,"Internal",null,"Choreographing Dance","Performing Arts",30,"Choreographing Dance",60,"Internal"]
["Engineering Maintenance",2,"Investigating an Engineered Product",30,"Internal",null,"Interaction Design","Art and Design Product Design",27,"Interaction Design",60,"Internal",null,"Directing Performance","Performing Arts",32,"Directing Performance",60,"Internal"]
["Engineering Maintenance",3,"Health and Safety in Engineering",30,"Internal",null,"Ceramics","Art and Design Product Design",30,"Ceramics",60,"Internal",null,"Planning and Managing a Performing Arts Event","Performing Arts",33,"Planning and Managing a Performing Arts Event",60,"Internal"]
["Engineering Maintenance",4,"Engineering Maintenance",30,"Internal",null,"Sustainability in Art and Design Practice","Art and Design Product Design",37,"Sustainability in Art and Design Practice",30,"Internal",null,"Multimedia Production","Performing Arts",34,"Multimedia Production",60,"Internal"]
["Engineering Maintenance",5,"Engineering Materials",30,"Internal",null,"Modelmaking","Art and Design Product Design",39,"Modelmaking",60,"Internal",null,"Physical Theatre Performance","Performing Arts",35,"Physical Theatre Performance",60,"Internal"]
["Engineering Maintenance",9,"Interpreting and Using Engineering Information",30,"External",null,"Using Mobile Devices in Art and Design","Art and Design Visual Arts",8,"Using Mobile Devices in Art and Design",30,"Internal",null,"Variety Performance","Performing Arts",36,"Variety Performance",60,"Internal"]
["Engineering Maintenance",10,"Mathematics for Engineering",30,"Internal",null,"Photography Briefs","Art and Design Visual Arts",14,"Photography Briefs",60,"Internal",null,"Use of ICT in the Performing Arts","Performing Arts",38,"Use of ICT in the Performing Arts",30,"Internal"]
["Engineering Maintenance",21,"Introduction to Communications for Engineering",60,"Internal",null,"Art, Craft and Design in the Creative Industries","Art and Design Visual Arts",17,"Art, Craft and Design in the Creative Industries",30,"Internal",null,"Work Experience in the Performing Arts","Performing Arts",39,"Work Experience in the Performing Arts",30,"Internal"]
["Engineering Manufacturing",1,"The Engineered World",30,"External",null,"Digital Art and Design Briefs","Art and Design Visual Arts",19,"Digital Art and Design Briefs",60,"Internal",null,"Singing Skills in the Performing Arts","Performing Arts",40,"Singing Skills in the Performing Arts",60,"Internal"]
["Engineering Manufacturing",2,"Investigating an Engineered Product",30,"Internal",null,"Painting Briefs","Art and Design Visual Arts",21,"Painting Briefs",60,"Internal",null,"Contemporary Dance Techniques","Performing Arts Acting",16,"Contemporary Dance Techniques",30,"Internal"]
["Engineering Manufacturing",3,"Health and Safety in Engineering",30,"Internal",null,"Moving Image Briefs","Art and Design Visual Arts",26,"Moving Image Briefs",60,"Internal",null,"Exploring Urban Dance Styles","Performing Arts Acting",17,"Exploring Urban Dance Styles",30,"Internal"]
["Engineering Manufacturing",5,"Engineering Materials",30,"Internal",null,"Printmaking Briefs","Art and Design Visual Arts",28,"Printmaking Briefs",60,"Internal",null,"Jazz Dance Techniques","Performing Arts Acting",18,"Jazz Dance Techniques",30,"Internal"]
["Engineering Manufacturing",9,"Interpreting and Using Engineering Information",30,"External",null,"Drawing from Observation","Art and Design Visual Arts",29,"Drawing from Observation",60,"Internal",null,"Design Planning for Performance","Performing Arts Acting",19,"Design Planning for Performance",30,"Internal"]
["Engineering Manufacturing",10,"Mathematics for Engineering",30,"Internal",null,"Ceramics","Art and Design Visual Arts",30,"Ceramics",60,"Internal",null,"Realising Costume Design for Performance","Performing Arts Acting",20,"Realising Costume Design for Performance",30,"Internal"]
["Engineering Manufacturing",21,"Introduction to Communications for Engineering",60,"Internal",null,"Surface Design","Art and Design Visual Arts",36,"Surface Design",60,"Internal",null,"Realising Set Design for Performance","Performing Arts Acting",21,"Realising Set Design for Performance",30,"Internal"]
["Engineering Mechanical",1,"The Engineered World",30,"External",null,"Sustainability in Art and Design Practice","Art and Design Visual Arts",37,"Sustainability in Art and Design Practice",30,"Internal",null,"Realising Prop Design for Performance","Performing Arts Acting",22,"Realising Prop Design for Performance",30,"Internal"]
["Engineering Mechanical",2,"Investigating an Engineered Product",30,"Internal",null,"Modelmaking","Art and Design Visual Arts",39,"Modelmaking",60,"Internal",null,"Realising Mask Design for Performance","Performing Arts Acting",23,"Realising Mask Design for Performance",30,"Internal"]
["Engineering Mechanical",3,"Health and Safety in Engineering",30,"Internal",null,"Sculpture","Art and Design Visual Arts",40,"Sculpture",60,"Internal",null,"Lighting for Performance","Performing Arts Acting",24,"Lighting for Performance",30,"Internal"]
["Engineering Mechanical",5,"Engineering Materials",30,"Internal",null,"Communicating Ideas in 3D","Art and Design Visual Communication",4,"Communicating Ideas in 3D",30,"Internal",null,"Sound for Performance","Performing Arts Acting",25,"Sound for Performance",30,"Internal"]
["Engineering Mechanical",9,"Interpreting and Using Engineering Information",30,"External",null,"Using Mobile Devices in Art and Design","Art and Design Visual Communication",8,"Using Mobile Devices in Art and Design",30,"Internal",null,"Make-up for Performance","Performing Arts Acting",28,"Make-up for Performance",30,"Internal"]
["Engineering Mechanical",10,"Mathematics for Engineering",30,"Internal",null,"Fashion Briefs","Art and Design Visual Communication",10,"Fashion Briefs",60,"Internal",null,"Wardrobe for Stage Performance","Performing Arts Acting",29,"Wardrobe for Stage Performance",30,"Internal"]
["Engineering Mechanical",21,"Introduction to Communications for Engineering",60,"Internal",null,"Photography Briefs","Art and Design Visual Communication",14,"Photography Briefs",60,"Internal",null,"Use of ICT in the Performing Arts","Performing Arts Acting",38,"Use of ICT in the Performing Arts",30,"Internal"]
["Health and Social Care",1,"Human Lifespan Development",30,"External",null,"Designing for the Future","Art and Design Visual Communication",15,"Designing for the Future",60,"Internal",null,"Work Experience in the Performing Arts","Performing Arts Acting",39,"Work Experience in the Performing Arts",30,"Internal"]
["Health and Social Care",2,"Health and Social Care Values",30,"Internal",null,"Art, Craft and Design in the Creative Industries","Art and Design Visual Communication",17,"Art, Craft and Design in the Creative Industries",30,"Internal",null,"Voice and Speech for Performers","Performing Arts Dance",14,"Voice and Speech for Performers",30,"Internal"]
["Health and Social Care",3,"Effective Communication in Health and Social Care",30,"Internal",null,"Digital Art and Design Briefs","Art and Design Visual Communication",19,"Digital Art and Design Briefs",60,"Internal",null,"Performing Scripted Plays","Performing Arts Dance",15,"Performing Scripted Plays",30,"Internal"]
["Health and Social Care",7,"Equality and Diversity in Health and Social Care",30,"Internal",null,"Interactive Media Production Briefs","Art and Design Visual Communication",20,"Interactive Media Production Briefs",60,"Internal",null,"Design Planning for Performance","Performing Arts Dance",19,"Design Planning for Performance",30,"Internal"]
["Health and Social Care",8,"Individual Rights in Health and Social Care",30,"Internal",null,"Moving Image Briefs","Art and Design Visual Communication",26,"Moving Image Briefs",60,"Internal",null,"Realising Costume Design for Performance","Performing Arts Dance",20,"Realising Costume Design for Performance",30,"Internal"]
["Health and Social Care",9,"Healthy Living",30,"External",null,"Interaction Design","Art and Design Visual Communication",27,"Interaction Design",60,"Internal",null,"Realising Set Design for Performance","Performing Arts Dance",21,"Realising Set Design for Performance",30,"Internal"]
["Health and Social Care",15,"Carrying out a Research Project in Health and Social Care",60,"Internal",null,"Designing for Print and Screen","Art and Design Visual Communication",33,"Designing for Print and Screen",60,"Internal",null,"Realising Prop Design for Performance","Performing Arts Dance",22,"Realising Prop Design for Performance",30,"Internal"]
["Hospitality",1,"Introducing the Hospitality Industry",30,"External",null,"Editing Photographic Images","Art and Design Visual Communication",34,"Editing Photographic Images",60,"Internal",null,"Realising Mask Design for Performance","Performing Arts Dance",23,"Realising Mask Design for Performance",30,"Internal"]
["Hospitality",2,"Working in the Hospitality Industry",30,"Internal",null,"Sustainability in Art and Design Practice","Art and Design Visual Communication",37,"Sustainability in Art and Design Practice",30,"Internal",null,"Lighting for Performance","Performing Arts Dance",24,"Lighting for Performance",30,"Internal"]
["Hospitality",3,"Food Safety and Health and Safety in Hospitality",30,"Internal",null,"Advertising Briefs","Art and Design Visual Communication",38,"Advertising Briefs",60,"Internal",null,"Sound for Performance","Performing Arts Dance",25,"Sound for Performance",30,"Internal"]
["Hospitality",9,"How the Hospitality Industry Contributes to Healthy Lifestyles",30,"External",null,"Modelmaking","Art and Design Visual Communication",39,"Modelmaking",60,"Internal",null,"Make-up for Performance","Performing Arts Dance",28,"Make-up for Performance",30,"Internal"]
["Hospitality",14,"Teamwork in Hospitality",60,"Internal",null,"Principles of Customer Services","Business",4,"Principles of Customer Services",30,"Internal",null,"Wardrobe for Stage Performance","Performing Arts Dance",29,"Wardrobe for Stage Performance",30,"Internal"]
["Hospitality",18,"Delivering the Hospitality Customer Experience",30,"Internal",null,"Sales and Personal Selling","Business",5,"Sales and Personal Selling",30,"Internal",null,"Use of ICT in the Performing Arts","Performing Arts Dance",38,"Use of ICT in the Performing Arts",30,"Internal"]
["Information and Creative Technology",1,"The Online World",30,"External",null,"Introducing Retail Business","Business",6,"Introducing Retail Business",30,"Internal",null,"Work Experience in the Performing Arts","Performing Arts Dance",39,"Work Experience in the Performing Arts",30,"Internal"]
["Information and Creative Technology",2,"Technology Systems",30,"External",null,"Providing Business Support","Business",7,"Providing Business Support",30,"Internal",null,"Movement Skills","Performing Arts Production",10,"Movement Skills",30,"Internal"]
["Information and Creative Technology",3,"A Digital Portfolio",30,"Internal",null,"Recruitment, Selection and Employment","Business",8,"Recruitment, Selection and Employment",30,"Internal",null,"Devising Performance Work","Performing Arts Production",11,"Devising Performance Work",30,"Internal"]
["Information and Creative Technology",17,"Multimedia Products Development",60,"Internal",null,"Using Business Documentation","Business",10,"Using Business Documentation",30,"Internal",null,"Exploring Improvisation","Performing Arts Production",12,"Exploring Improvisation",30,"Internal"]
["Information and Creative Technology",18,"Computational Thinking",30,"Internal",null,"Building Successful Business Teams","Business",11,"Building Successful Business Teams",30,"Internal",null,"Multimedia Performance","Performing Arts Production",13,"Multimedia Performance",30,"Internal"]
["Information and Creative Technology",19,"Computing in the Workplace",60,"Internal",null,"Introducing Law and Consumer Rights","Business",12,"Introducing Law and Consumer Rights",30,"Internal",null,"Voice and Speech for Performers","Performing Arts Production",14,"Voice and Speech for Performers",30,"Internal"]
["Information and Creative Technology Computer Science",1,"The Online World",30,"External",null,"Financial Planning and Forecasting","Business",13,"Financial Planning and Forecasting",30,"Internal",null,"Performing Scripted Plays","Performing Arts Production",15,"Performing Scripted Plays",30,"Internal"]
["Information and Creative Technology Computer Science",2,"Technology Systems",30,"External",null,"Business Online","Business",14,"Business Online",60,"Internal",null,"Contemporary Dance Techniques","Performing Arts Production",16,"Contemporary Dance Techniques",30,"Internal"]
["Information and Creative Technology Computer Science",3,"A Digital Portfolio",30,"Internal",null,"Public Sector Business","Business",15,"Public Sector Business",30,"Internal",null,"Exploring Urban Dance Styles","Performing Arts Production",17,"Exploring Urban Dance Styles",30,"Internal"]
["Information and Creative Technology Computer Science",12,"Software Development",60,"Internal",null,"Enhancing the Customer Experience","Business",16,"Enhancing the Customer Experience",30,"Internal",null,"Jazz Dance Techniques","Performing Arts Production",18,"Jazz Dance Techniques",30,"Internal"]
["Information and Creative Technology Computer Science",17,"Multimedia Products Development",60,"Internal",null,"Visual Merchandising in Retail Business","Business",17,"Visual Merchandising in Retail Business",30,"Internal",null,"Leading Sports Activities","Sport",6,"Leading Sports Activities",30,"Internal"]
["Information and Creative Technology Computer Science",18,"Computational Thinking",30,"Internal",null,"Delivering and Improving Customer Service","Business",20,"Delivering and Improving Customer Service",60,"Internal",null,"Promotion and Sponsorship in Sport","Sport",8,"Promotion and Sponsorship in Sport",30,"Internal"]
["Information and Creative Technology Computer Science",19,"Computing in the Workplace",60,"Internal",null,"Effective Business Communication","Business",21,"Effective Business Communication",60,"Internal",null,"Lifestyle and Well-being","Sport",9,"Lifestyle and Well-being",30,"Internal"]
["Information and Creative Technology Computer Science",24,"Software Systems Development",60,"Internal",null,"Working in Business Teams","Business",22,"Working in Business Teams",60,"Internal",null,"Injury and the Sports Performer","Sport",10,"Injury and the Sports Performer",30,"Internal"]
["Information and Creative Technology Systems Development and Support",1,"The Online World",30,"External",null,"Planning, Forecasting and Recording Business Finances","Business",23,"Planning, Forecasting and Recording Business Finances",60,"Internal",null,"Running a Sports Event","Sport",11,"Running a Sports Event",30,"Internal"]
["Information and Creative Technology Systems Development and Support",2,"Technology Systems",30,"External",null,"Work Experience in Business","Business",24,"Work Experience in Business",60,"Internal",null,"The Sport and Active Leisure Industry","Sport",12,"The Sport and Active Leisure Industry",30,"Internal"]
["Information and Creative Technology Systems Development and Support",3,"A Digital Portfolio",30,"Internal",null,"Introducing International Business","Business",25,"Introducing International Business",60,"Internal",null,"Profiling Sports Performance","Sport",13,"Profiling Sports Performance",30,"Internal"]
["Information and Creative Technology Systems Development and Support",11,"Computer Networks",60,"Internal",null,"Introducing the Economic Environment","Business",26,"Introducing the Economic Environment",60,"Internal",null,"The Provision of Sport and Active Leisure","Sport",16,"The Provision of Sport and Active Leisure",30,"Internal"]
["Information and Creative Technology Systems Development and Support",17,"Multimedia Products Development",60,"Internal",null,"Efficient Business Operations","Business",27,"Efficient Business Operations",60,"Internal",null,"Sport Community Volunteering","Sport",23,"Sport Community Volunteering",30,"Internal"]
["Information and Creative Technology Systems Development and Support",18,"Computational Thinking",30,"Internal",null,"Principles of Procurement and Supply","Business",28,"Principles of Procurement and Supply",60,"Internal",null,"Leading Sports Activities","Sport Outdoor and Adventurous Activities",6,"Leading Sports Activities",30,"Internal"]
["Information and Creative Technology Systems Development and Support",19,"Computing in the Workplace",60,"Internal",null,"Implementing Procurement and Supply in Business","Business",29,"Implementing Procurement and Supply in Business",60,"Internal",null,"Promotion and Sponsorship in Sport","Sport Outdoor and Adventurous Activities",8,"Promotion and Sponsorship in Sport",30,"Internal"]
["Information and Creative Technology Systems Development and Support",22,"Computer Security in Practice",60,"Internal",null,"Corporate Social Responsibility","Business",30,"Corporate Social Responsibility",30,"Internal",null,"Lifestyle and Well-being","Sport Outdoor and Adventurous Activities",9,"Lifestyle and Well-being",30,"Internal"]
["Music",1,"The Music Industry",30,"External",null,"Managing Personal Finances","Business",31,"Managing Personal Finances",30,"Internal",null,"Injury and the Sports Performer","Sport Outdoor and Adventurous Activities",10,"Injury and the Sports Performer",30,"Internal"]
["Music",2,"Managing a Music Product",30,"Internal",null,"Sustainability in the Business Workplace","Business",32,"Sustainability in the Business Workplace",30,"Internal",null,"Running a Sports Event","Sport Outdoor and Adventurous Activities",11,"Running a Sports Event",30,"Internal"]
["Music",8,"Music and Production Analysis",30,"External",null,"Construction Drawing Techniques","Construction and the Built Environment",5,"Construction Drawing Techniques",30,"Internal",null,"The Sport and Active Leisure Industry","Sport Outdoor and Adventurous Activities",12,"The Sport and Active Leisure Industry",30,"Internal"]
["Music",16,"Music Showcase",30,"Internal",null,"Exploring Carpentry and Joinery Principles and Techniques","Construction and the Built Environment",6,"Exploring Carpentry and Joinery Principles and Techniques",30,"Internal",null,"Profiling Sports Performance","Sport Outdoor and Adventurous Activities",13,"Profiling Sports Performance",30,"Internal"]
["Music",17,"Researching a Music Topic",60,"Internal",null,"Exploring Brickwork and Blockwork Principles and Techniques","Construction and the Built Environment",7,"Exploring Brickwork and Blockwork Principles and Techniques",30,"Internal",null,"Designing Exercise Programmes","Sport Outdoor and Adventurous Activities",15,"Designing Exercise Programmes",60,"Internal"]
["Music",28,"Professional Skills in Music",60,"Internal",null,"Exploring Painting and Decorating Principles and Techniques","Construction and the Built Environment",8,"Exploring Painting and Decorating Principles and Techniques",30,"Internal",null,"The Provision of Sport and Active Leisure","Sport Outdoor and Adventurous Activities",16,"The Provision of Sport and Active Leisure",30,"Internal"]
["Performing Arts",1,"Individual Showcase",30,"External",null,"Exploring Plumbing Principles and Techniques","Construction and the Built Environment",9,"Exploring Plumbing Principles and Techniques",30,"Internal",null,"Facility Operations for Sport and Leisure","Sport Outdoor and Adventurous Activities",17,"Facility Operations for Sport and Leisure",60,"Internal"]
["Performing Arts",2,"Preparation, Performance and Production",30,"Internal",null,"Exploring Electrical Principles and Techniques","Construction and the Built Environment",10,"Exploring Electrical Principles and Techniques",30,"Internal",null,"Sport Community Volunteering","Sport Outdoor and Adventurous Activities",23,"Sport Community Volunteering",30,"Internal"]
["Performing Arts",8,"The Performing Arts Industry",30,"External",null,"Exploring Roofing Principles and Techniques","Construction and the Built Environment",13,"Exploring Roofing Principles and Techniques",30,"Internal",null,"Work Experience in Sport","Sport Outdoor and Adventurous Activities",24,"Work Experience in Sport",60,"Internal"]
["Performing Arts",9,"Performance in Context",30,"Internal",null,"Exploring Wall and Floor Tiling Principles and Techniques","Construction and the Built Environment",14,"Exploring Wall and Floor Tiling Principles and Techniques",30,"Internal",null,"Leading Sports Activities","Sport Fitness and Exercise",6,"Leading Sports Activities",30,"Internal"]
["Performing Arts",31,"Community Arts",60,"Internal",null,"Exploring Plastering and Dry Lining Principles and Techniques","Construction and the Built Environment",15,"Exploring Plastering and Dry Lining Principles and Techniques",30,"Internal",null,"Promotion and Sponsorship in Sport","Sport Fitness and Exercise",8,"Promotion and Sponsorship in Sport",30,"Internal"]
["Performing Arts",37,"Performing Arts Enterprise",60,"Internal",null,"Carpentry and Joinery Operations","Construction and the Built Environment",16,"Carpentry and Joinery Operations",60,"Internal",null,"Running a Sports Event","Sport Fitness and Exercise",11,"Running a Sports Event",30,"Internal"]
["Performing Arts Acting",1,"Individual Showcase",30,"External",null,"Brickwork and Blockwork Operations","Construction and the Built Environment",17,"Brickwork and Blockwork Operations",60,"Internal",null,"The Sport and Active Leisure Industry","Sport Fitness and Exercise",12,"The Sport and Active Leisure Industry",30,"Internal"]
["Performing Arts Acting",2,"Preparation, Performance and Production",30,"Internal",null,"Painting and Paperhanging Operations","Construction and the Built Environment",18,"Painting and Paperhanging Operations",60,"Internal",null,"Profiling Sports Performance","Sport Fitness and Exercise",13,"Profiling Sports Performance",30,"Internal"]
["Performing Arts Acting",3,"Acting Skills",60,"Internal",null,"Plumbing Operations","Construction and the Built Environment",19,"Plumbing Operations",30,"Internal",null,"The Provision of Sport and Active Leisure","Sport Fitness and Exercise",16,"The Provision of Sport and Active Leisure",30,"Internal"]
["Performing Arts Acting",8,"The Performing Arts Industry",30,"External",null,"Electrical Operations","Construction and the Built Environment",20,"Electrical Operations",30,"Internal",null,"Sport Community Volunteering","Sport Fitness and Exercise",23,"Sport Community Volunteering",30,"Internal"]
["Performing Arts Acting",9,"Performance in Context",30,"Internal",null,"Tendering and Estimating","Construction and the Built Environment",22,"Tendering and Estimating",60,"Internal"]
["Performing Arts Acting",31,"Community Arts",60,"Internal",null,"Exploring Surveying","Construction and the Built Environment",23,"Exploring Surveying",60,"Internal"]
["Performing Arts Acting",37,"Performing Arts Enterprise",60,"Internal",null,"Exploring Civil Engineering","Construction and the Built Environment",24,"Exploring Civil Engineering",60,"Internal"]
["Performing Arts Dance",1,"Individual Showcase",30,"External",null,"Exploring Building Services Engineering","Construction and the Built Environment",25,"Exploring Building Services Engineering",60,"Internal"]
["Performing Arts Dance",2,"Preparation, Performance and Production",30,"Internal",null,"Exploring Facilities Management","Construction and the Built Environment",26,"Exploring Facilities Management",60,"Internal"]
["Performing Arts Dance",4,"Dance Skills",60,"Internal",null,"Construction Work Experience","Construction and the Built Environment",27,"Construction Work Experience",30,"Internal"]
["Performing Arts Dance",8,"The Performing Arts Industry",30,"External",null,"Communications for Construction and the Built Environment","Construction and the Built Environment",28,"Communications for Construction and the Built Environment",30,"Internal"]
["Performing Arts Dance",9,"Performance in Context",30,"Internal",null,"Digital Moving Image Production","Creative Digital Media Production",3,"Digital Moving Image Production",30,"Internal"]
["Performing Arts Dance",31,"Community Arts",60,"Internal",null,"Digital Audio Production","Creative Digital Media Production",4,"Digital Audio Production",30,"Internal"]
["Performing Arts Dance",37,"Performing Arts Enterprise",60,"Internal",null,"Digital Publishing Production","Creative Digital Media Production",5,"Digital Publishing Production",30,"Internal"]
["Performing Arts Production",1,"Individual Showcase",30,"External",null,"Website Production","Creative Digital Media Production",6,"Website Production",30,"Internal"]
["Performing Arts Production",2,"Preparation, Performance and Production",30,"Internal",null,"Digital Games Production","Creative Digital Media Production",7,"Digital Games Production",30,"Internal"]
["Performing Arts Production",7,"Production Skills for Performance",60,"Internal",null,"Digital Editing for Moving Image","Creative Digital Media Production",9,"Digital Editing for Moving Image",60,"Internal"]
["Performing Arts Production",8,"The Performing Arts Industry",30,"External",null,"Digital Photography for a Media Product","Creative Digital Media Production",10,"Digital Photography for a Media Product",60,"Internal"]
["Performing Arts Production",9,"Performance in Context",30,"Internal",null,"Animation for Digital Media","Creative Digital Media Production",11,"Animation for Digital Media",60,"Internal"]
["Performing Arts Production",31,"Community Arts",60,"Internal",null,"Digital Audio Editing","Creative Digital Media Production",12,"Digital Audio Editing",30,"Internal"]
["Performing Arts Production",37,"Performing Arts Enterprise",60,"Internal",null,"Graphic Design for Digital Media","Creative Digital Media Production",13,"Graphic Design for Digital Media",30,"Internal"]
["Public Services",1,"The Role and Work of the Public Services",30,"External",null,"Writing for Digital Media","Creative Digital Media Production",14,"Writing for Digital Media",30,"Internal"]
["Public Services",2,"Working Skills in the Public Services Sector",30,"Internal",null,"Digital Games Testing","Creative Digital Media Production",15,"Digital Games Testing",30,"Internal"]
["Public Services",6,"Citizenship, Society and the Public Services",30,"External",null,"Digital Art for a Media Product","Creative Digital Media Production",16,"Digital Art for a Media Product",30,"Internal"]
["Public Services",7,"Crime and its Effects on Society and Individuals",60,"Internal",null,"Digital Audio Mixing","Creative Digital Media Production",17,"Digital Audio Mixing",30,"Internal"]
["Public Services",16,"Employability Skills in the Public Services",30,"Internal",null,"Lighting for Moving Image","Creative Digital Media Production",18,"Lighting for Moving Image",30,"Internal"]
["Public Services",19,"Carrying out a Project in Public Services",60,"Internal",null,"Advertising Production","Creative Digital Media Production",19,"Advertising Production",60,"Internal"]
["Sport",1,"Fitness for Sport and Exercise",30,"External",null,"Factual Media Production","Creative Digital Media Production",20,"Factual Media Production",60,"Internal"]
["Sport",2,"Practical Sports Performance",30,"Internal",null,"Machining Techniques","Engineering",7,"Machining Techniques",60,"Internal"]
["Sport",3,"The Mind and Sports Performance",30,"Internal",null,"Electronic Circuit Design and Construction","Engineering",8,"Electronic Circuit Design and Construction",60,"Internal"]
["Sport",4,"The Sports Performer in Action",30,"Internal",null,"Engineering Design","Engineering",12,"Engineering Design",60,"Internal"]
["Sport",5,"Training for Personal Fitness",30,"Internal",null,"Operating an Efficient Workplace","Engineering",15,"Operating an Efficient Workplace",60,"Internal"]
["Sport",7,"Anatomy and Physiology for Sports Performance",30,"External",null,"Computer Numerical Control Programming","Engineering",18,"Computer Numerical Control Programming",60,"Internal"]
["Sport",14,"Carrying Out a Sports-related Project",60,"Internal",null,"Electronic Devices and Communication Applications","Engineering Technology",23,"Electronic Devices and Communication Applications",60,"Internal"]
["Sport Outdoor and Adventurous Activities",1,"Fitness for Sport and Exercise",30,"External",null,"PC Software and Hardware in Engineering","Engineering Technology",34,"PC Software and Hardware in Engineering",60,"Internal"]
["Sport Outdoor and Adventurous Activities",2,"Practical Sports Performance",30,"Internal",null,"Operation and Maintenance of Mechanical Systems and Components","Engineering Maintenance",24,"Operation and Maintenance of Mechanical Systems and Components",60,"Internal"]
["Sport Outdoor and Adventurous Activities",3,"The Mind and Sports Performance",30,"Internal",null,"Operation and Maintenance of Electronic Systems and Components","Engineering Maintenance",25,"Operation and Maintenance of Electronic Systems and Components",60,"Internal"]
["Sport Outdoor and Adventurous Activities",4,"The Sports Performer in Action",30,"Internal",null,"Operation and Maintenance of Electrical Systems and Components","Engineering Maintenance",26,"Operation and Maintenance of Electrical Systems and Components",60,"Internal"]
["Sport Outdoor and Adventurous Activities",5,"Training for Personal Fitness",30,"Internal",null,"Operation and Maintenance of Fluid Power Systems and Components","Engineering Maintenance",27,"Operation and Maintenance of Fluid Power Systems and Components",60,"Internal"]
["Sport Outdoor and Adventurous Activities",7,"Anatomy and Physiology for Sports Performance",30,"External",null,"Operating an Efficient Workplace","Engineering Manufacturing",15,"Operating an Efficient Workplace",60,"Internal"]
["Sport Outdoor and Adventurous Activities",14,"Carrying Out a Sports-related Project",60,"Internal",null,"Continuous Improvement and Problem-Solving","Engineering Manufacturing",22,"Continuous Improvement and Problem-Solving",60,"Internal"]
["Sport Fitness and Exercise",1,"Fitness for Sport and Exercise",30,"External",null,"Electronic Devices and Communication Applications","Engineering Manufacturing",23,"Electronic Devices and Communication Applications",60,"Internal"]
["Sport Fitness and Exercise",2,"Practical Sports Performance",30,"Internal",null,"Machining Techniques","Engineering Mechanical",7,"Machining Techniques",60,"Internal"]
["Sport Fitness and Exercise",3,"The Mind and Sports Performance",30,"Internal",null,"Fabrication Techniques","Engineering Mechanical",28,"Fabrication Techniques",60,"Internal"]
["Sport Fitness and Exercise",4,"The Sports Performer in Action",30,"Internal",null,"Casting Techniques","Engineering Mechanical",29,"Casting Techniques",60,"Internal"]
["Sport Fitness and Exercise",5,"Training for Personal Fitness",30,"Internal",null,"Human Body Systems and Care of Disorders","Health and Social Care",10,"Human Body Systems and Care of Disorders",60,"Internal"]
["Sport Fitness and Exercise",7,"Anatomy and Physiology for Sports Performance",30,"External",null,"Creative and Therapeutic Activities in Health and Social Care","Health and Social Care",12,"Creative and Therapeutic Activities in Health and Social Care",60,"Internal"]
["Sport Fitness and Exercise",9,"Lifestyle and Well-being",30,"Internal",null,"Vocational Experience in Health and Social Care","Health and Social Care",16,"Vocational Experience in Health and Social Care",60,"Internal"]
["Sport Fitness and Exercise",10,"Injury and the Sports Performer",30,"Internal",null,"Community Volunteering in Health and Social Care","Health and Social Care",17,"Community Volunteering in Health and Social Care",60,"Internal"]
["Sport Fitness and Exercise",14,"Carrying Out a Sports-related Project",60,"Internal",null,"Child Development and Observation","Health and Social Care",18,"Child Development and Observation",60,"Internal"]
["Sport Fitness and Exercise",15,"Designing Exercise Programmes",60,"Internal",null,"Skills and Qualities for Working in the Health and Social Care Sector","Health and Social Care",19,"Skills and Qualities for Working in the Health and Social Care Sector",60,"Internal"]
["Travel and Tourism",1,"The UK Travel and Tourism Sector",30,"External",null,"Understanding Disability","Health and Social Care",20,"Understanding Disability",60,"Internal"]
["Travel and Tourism",2,"UK Travel and Tourism Destinations",30,"Internal",null,"Introduction to Dementia","Health and Social Care",21,"Introduction to Dementia",60,"Internal"]
["Travel and Tourism",3,"The Development of Travel and Tourism in the UK",30,"Internal",null,"Costing and Controlling Finances in the Hospitality Industry","Hospitality",4,"Costing and Controlling Finances in the Hospitality Industry",30,"Internal"]
["Travel and Tourism",4,"International Travel and Tourism Destinations",30,"Internal",null,"Enterprise in the Hospitality Industry","Hospitality",5,"Enterprise in the Hospitality Industry",30,"Internal"]
["Travel and Tourism",5,"Factors Affecting Worldwide Travel and Tourism",30,"Internal",null,"Planning, Preparing, Cooking and Finishing Food","Hospitality",6,"Planning, Preparing, Cooking and Finishing Food",30,"Internal"]
["Travel and Tourism",7,"Travel and Tourism Business Environments",30,"External",null,"Food and Beverage Service in the Hospitality Industry","Hospitality",7,"Food and Beverage Service in the Hospitality Industry",30,"Internal"]
["Travel and Tourism",11,"Delivering the Travel and Tourism Customer Experience",60,"Internal",null,"Front Office Services in the Hospitality Industry","Hospitality",8,"Front Office Services in the Hospitality Industry",30,"Internal"]
[null,null,null,null,null,null,"Marketing and Promotion in Hospitality","Hospitality",10,"Marketing and Promotion in Hospitality",30,"Internal"]
[null,null,null,null,null,null,"Accommodation Services in the Hospitality Industry","Hospitality",11,"Accommodation Services in the Hospitality Industry",30,"Internal"]
[null,null,null,null,null,null,"Planning and Running a Hospitality Event","Hospitality",12,"Planning and Running a Hospitality Event",60,"Internal"]
[null,null,null,null,null,null,"Contemporary World Food Cooking Skills","Hospitality",13,"Contemporary World Food Cooking Skills",60,"Internal"]
[null,null,null,null,null,null,"Menu Planning","Hospitality",15,"Menu Planning",60,"Internal"]
[null,null,null,null,null,null,"Managing Finance in Hospitality","Hospitality",16,"Managing Finance in Hospitality",60,"Internal"]
[null,null,null,null,null,null,"Alcohol Awareness in Hospitality","Hospitality",17,"Alcohol Awareness in Hospitality",30,"Internal"]
[null,null,null,null,null,null,"Hospitality Research Project","Hospitality",19,"Hospitality Research Project",60,"Internal"]
[null,null,null,null,null,null,"Work Experience in Hospitality","Hospitality",20,"Work Experience in Hospitality",60,"Internal"]
[null,null,null,null,null,null,"Hospitality Community Volunteering","Hospitality",21,"Hospitality Community Volunteering",60,"Internal"]
[null,null,null,null,null,null,"Sales and Merchandising in Hospitality","Hospitality",22,"Sales and Merchandising in Hospitality",60,"Internal"]
[null,null,null,null,null,null,"Barista Skills in Hospitality","Hospitality",23,"Barista Skills in Hospitality",30,"Internal"]
[null,null,null,null,null,null,"Database Development","Information and Creative Technology",10,"Database Development",60,"Internal"]
[null,null,null,null,null,null,"Computer Networks","Information and Creative Technology",11,"Computer Networks",60,"Internal"]
[null,null,null,null,null,null,"Software Development","Information and Creative Technology",12,"Software Development",60,"Internal"]
[null,null,null,null,null,null,"Website Development","Information and Creative Technology",13,"Website Development",60,"Internal"]
[null,null,null,null,null,null,"Installing and Maintaining Computer Hardware","Information and Creative Technology",14,"Installing and Maintaining Computer Hardware",60,"Internal"]
[null,null,null,null,null,null,"Installing and Maintaining Computer Software","Information and Creative Technology",15,"Installing and Maintaining Computer Software",60,"Internal"]
[null,null,null,null,null,null,"Automated Computer Systems","Information and Creative Technology",16,"Automated Computer Systems",60,"Internal"]
[null,null,null,null,null,null,"A Technology Business","Information and Creative Technology",21,"A Technology Business",60,"Internal"]
[null,null,null,null,null,null,"Computer Security in Practice","Information and Creative Technology",22,"Computer Security in Practice",60,"Internal"]
[null,null,null,null,null,null,"Computer Systems Support in Practice","Information and Creative Technology",23,"Computer Systems Support in Practice",60,"Internal"]
[null,null,null,null,null,null,"Software Systems Development","Information and Creative Technology",24,"Software Systems Development",60,"Internal"]
[null,null,null,null,null,null,"Creating Digital Animation","Information and Creative Technology Computer Science",4,"Creating Digital Animation",30,"Internal"]
[null,null,null,null,null,null,"Creating Digital Audio","Information and Creative Technology Computer Science",5,"Creating Digital Audio",30,"Internal"]
[null,null,null,null,null,null,"Creating Digital Graphics","Information and Creative Technology Computer Science",6,"Creating Digital Graphics",30,"Internal"]
[null,null,null,null,null,null,"Creating Digital Video","Information and Creative Technology Computer Science",7,"Creating Digital Video",30,"Internal"]
[null,null,null,null,null,null,"Mobile Apps Development","Information and Creative Technology Computer Science",8,"Mobile Apps Development",30,"Internal"]
[null,null,null,null,null,null,"Spreadsheet Development","Information and Creative Technology Computer Science",9,"Spreadsheet Development",30,"Internal"]
[null,null,null,null,null,null,"Database Development","Information and Creative Technology Computer Science",10,"Database Development",60,"Internal"]
[null,null,null,null,null,null,"Computer Networks","Information and Creative Technology Computer Science",11,"Computer Networks",60,"Internal"]
[null,null,null,null,null,null,"Website Development","Information and Creative Technology Computer Science",13,"Website Development",60,"Internal"]
[null,null,null,null,null,null,"Installing and Maintaining Computer Hardware","Information and Creative Technology Computer Science",14,"Installing and Maintaining Computer Hardware",60,"Internal"]
[null,null,null,null,null,null,"Installing and Maintaining Computer Software","Information and Creative Technology Computer Science",15,"Installing and Maintaining Computer Software",60,"Internal"]
[null,null,null,null,null,null,"Automated Computer Systems","Information and Creative Technology Computer Science",16,"Automated Computer Systems",60,"Internal"]
[null,null,null,null,null,null,"Building a Personal Computer","Information and Creative Technology Computer Science",20,"Building a Personal Computer",30,"Internal"]
[null,null,null,null,null,null,"A Technology Business","Information and Creative Technology Computer Science",21,"A Technology Business",60,"Internal"]
[null,null,null,null,null,null,"Computer Systems Support in Practice","Information and Creative Technology Computer Science",23,"Computer Systems Support in Practice",60,"Internal"]
[null,null,null,null,null,null,"IT Work Experience","Information and Creative Technology Computer Science",25,"IT Work Experience",30,"Internal"]
[null,null,null,null,null,null,"Creating Digital Animation","Information and Creative Technology Systems Development and Support",4,"Creating Digital Animation",30,"Internal"]
[null,null,null,null,null,null,"Creating Digital Audio","Information and Creative Technology Systems Development and Support",5,"Creating Digital Audio",30,"Internal"]
[null,null,null,null,null,null,"Creating Digital Graphics","Information and Creative Technology Systems Development and Support",6,"Creating Digital Graphics",30,"Internal"]
[null,null,null,null,null,null,"Creating Digital Video","Information and Creative Technology Systems Development and Support",7,"Creating Digital Video",30,"Internal"]
[null,null,null,null,null,null,"Mobile Apps Development","Information and Creative Technology Systems Development and Support",8,"Mobile Apps Development",30,"Internal"]
[null,null,null,null,null,null,"Spreadsheet Development","Information and Creative Technology Systems Development and Support",9,"Spreadsheet Development",30,"Internal"]
[null,null,null,null,null,null,"Database Development","Information and Creative Technology Systems Development and Support",10,"Database Development",60,"Internal"]
[null,null,null,null,null,null,"Software Development","Information and Creative Technology Systems Development and Support",12,"Software Development",60,"Internal"]
[null,null,null,null,null,null,"Website Development","Information and Creative Technology Systems Development and Support",13,"Website Development",60,"Internal"]
[null,null,null,null,null,null,"Installing and Maintaining Computer Hardware","Information and Creative Technology Systems Development and Support",14,"Installing and Maintaining Computer Hardware",60,"Internal"]
[null,null,null,null,null,null,"Installing and Maintaining Computer Software","Information and Creative Technology Systems Development and Support",15,"Installing and Maintaining Computer Software",60,"Internal"]
[null,null,null,null,null,null,"Automated Computer Systems","Information and Creative Technology Systems Development and Support",16,"Automated Computer Systems",60,"Internal"]
[null,null,null,null,null,null,"Building a Personal Computer","Information and Creative Technology Systems Development and Support",20,"Building a Personal Computer",30,"Internal"]
[null,null,null,null,null,null,"A Technology Business","Information and Creative Technology Systems Development and Support",21,"A Technology Business",60,"Internal"]
[null,null,null,null,null,null,"Computer Systems Support in Practice","Information and Creative Technology Systems Development and Support",23,"Computer Systems Support in Practice",60,"Internal"]
[null,null,null,null,null,null,"IT Work Experience","Information and Creative Technology Systems Development and Support",25,"IT Work Experience",30,"Internal"]
[null,null,null,null,null,null,"Introducing Live Sound","Music",3,"Introducing Live Sound",30,"Internal"]
[null,null,null,null,null,null,"Introducing Music Composition","Music",4,"Introducing Music Composition",30,"Internal"]
[null,null,null,null,null,null,"Introducing Music Performance","Music",5,"Introducing Music Performance",30,"Internal"]
[null,null,null,null,null,null,"Introducing Music Recording","Music",6,"Introducing Music Recording",30,"Internal"]
[null,null,null,null,null,null,"Introducing Music Sequencing","Music",7,"Introducing Music Sequencing",30,"Internal"]
[null,null,null,null,null,null,"Introducing Choral Studies","Music",9,"Introducing Choral Studies",30,"Internal"]
[null,null,null,null,null,null,"Introducing Music Theory","Music",10,"Introducing Music Theory",30,"Internal"]
[null,null,null,null,null,null,"Developing Solo Music Performance","Music",11,"Developing Solo Music Performance",60,"Internal"]
[null,null,null,null,null,null,"The Development of Music","Music",12,"The Development of Music",60,"Internal"]
[null,null,null,null,null,null,"Developing Music Composition","Music",13,"Developing Music Composition",60,"Internal"]
[null,null,null,null,null,null,"Producing a Music Recording","Music",14,"Producing a Music Recording",60,"Internal"]
[null,null,null,null,null,null,"Music Ensemble","Music",15,"Music Ensemble",60,"Internal"]
[null,null,null,null,null,null,"Developing Modern Music Production Skills","Music",18,"Developing Modern Music Production Skills",60,"Internal"]
[null,null,null,null,null,null,"Developing Music Theory","Music",19,"Developing Music Theory",60,"Internal"]
[null,null,null,null,null,null,"Music Fusion","Music",20,"Music Fusion",60,"Internal"]
[null,null,null,null,null,null,"Music Arrangement","Music",21,"Music Arrangement",60,"Internal"]
[null,null,null,null,null,null,"Exploring Music Improvisation","Music",22,"Exploring Music Improvisation",60,"Internal"]
[null,null,null,null,null,null,"Exploring DJing","Music",23,"Exploring DJing",60,"Internal"]
[null,null,null,null,null,null,"Music Promotion","Music",24,"Music Promotion",60,"Internal"]
[null,null,null,null,null,null,"Digital and Mobile Technology for Music","Music",25,"Digital and Mobile Technology for Music",60,"Internal"]
[null,null,null,null,null,null,"Composing for Visual Media","Music",26,"Composing for Visual Media",60,"Internal"]
[null,null,null,null,null,null,"Enterprise and Music","Music",27,"Enterprise and Music",60,"Internal"]
[null,null,null,null,null,null,"Acting Skills","Performing Arts",3,"Acting Skills",60,"Internal"]
[null,null,null,null,null,null,"Dance Skills","Performing Arts",4,"Dance Skills",60,"Internal"]
[null,null,null,null,null,null,"Musical Theatre Skills","Performing Arts",5,"Musical Theatre Skills",60,"Internal"]
[null,null,null,null,null,null,"Music Performance Skills","Performing Arts",6,"Music Performance Skills",60,"Internal"]
[null,null,null,null,null,null,"Production Skills for Performance","Performing Arts",7,"Production Skills for Performance",60,"Internal"]
[null,null,null,null,null,null,"Movement Skills","Performing Arts Acting",10,"Movement Skills",30,"Internal"]
[null,null,null,null,null,null,"Devising Performance Work","Performing Arts Acting",11,"Devising Performance Work",30,"Internal"]
[null,null,null,null,null,null,"Exploring Improvisation","Performing Arts Acting",12,"Exploring Improvisation",30,"Internal"]
[null,null,null,null,null,null,"Multimedia Performance","Performing Arts Acting",13,"Multimedia Performance",30,"Internal"]
[null,null,null,null,null,null,"Voice and Speech for Performers","Performing Arts Acting",14,"Voice and Speech for Performers",30,"Internal"]
[null,null,null,null,null,null,"Performing Scripted Plays","Performing Arts Acting",15,"Performing Scripted Plays",30,"Internal"]
[null,null,null,null,null,null,"Directing Performance","Performing Arts Acting",32,"Directing Performance",60,"Internal"]
[null,null,null,null,null,null,"Planning and Managing a Performing Arts Event","Performing Arts Acting",33,"Planning and Managing a Performing Arts Event",60,"Internal"]
[null,null,null,null,null,null,"Physical Theatre Performance","Performing Arts Acting",35,"Physical Theatre Performance",60,"Internal"]
[null,null,null,null,null,null,"Variety Performance","Performing Arts Acting",36,"Variety Performance",60,"Internal"]
[null,null,null,null,null,null,"Singing Skills in the Performing Arts","Performing Arts Acting",40,"Singing Skills in the Performing Arts",60,"Internal"]
[null,null,null,null,null,null,"Movement Skills","Performing Arts Dance",10,"Movement Skills",30,"Internal"]
[null,null,null,null,null,null,"Devising Performance Work","Performing Arts Dance",11,"Devising Performance Work",30,"Internal"]
[null,null,null,null,null,null,"Exploring Improvisation","Performing Arts Dance",12,"Exploring Improvisation",30,"Internal"]
[null,null,null,null,null,null,"Contemporary Dance Techniques","Performing Arts Dance",16,"Contemporary Dance Techniques",30,"Internal"]
[null,null,null,null,null,null,"Exploring Urban Dance Styles","Performing Arts Dance",17,"Exploring Urban Dance Styles",30,"Internal"]
[null,null,null,null,null,null,"Jazz Dance Techniques","Performing Arts Dance",18,"Jazz Dance Techniques",30,"Internal"]
[null,null,null,null,null,null,"Choreographing Dance","Performing Arts Dance",30,"Choreographing Dance",60,"Internal"]
[null,null,null,null,null,null,"Physical Theatre Performance","Performing Arts Dance",35,"Physical Theatre Performance",60,"Internal"]
[null,null,null,null,null,null,"Variety Performance","Performing Arts Dance",36,"Variety Performance",60,"Internal"]
[null,null,null,null,null,null,"Singing Skills in the Performing Arts","Performing Arts Dance",40,"Singing Skills in the Performing Arts",60,"Internal"]
[null,null,null,null,null,null,"Design Planning for Performance","Performing Arts Production",19,"Design Planning for Performance",30,"Internal"]
[null,null,null,null,null,null,"Realising Costume Design for Performance","Performing Arts Production",20,"Realising Costume Design for Performance",30,"Internal"]
[null,null,null,null,null,null,"Realising Set Design for Performance","Performing Arts Production",21,"Realising Set Design for Performance",30,"Internal"]
[null,null,null,null,null,null,"Realising Prop Design for Performance","Performing Arts Production",22,"Realising Prop Design for Performance",30,"Internal"]
[null,null,null,null,null,null,"Realising Mask Design for Performance","Performing Arts Production",23,"Realising Mask Design for Performance",30,"Internal"]
[null,null,null,null,null,null,"Lighting for Performance","Performing Arts Production",24,"Lighting for Performance",30,"Internal"]
[null,null,null,null,null,null,"Sound for Performance","Performing Arts Production",25,"Sound for Performance",30,"Internal"]
[null,null,null,null,null,null,"Supporting Performance: Stage Management","Performing Arts Production",26,"Supporting Performance: Stage Management",30,"Internal"]
[null,null,null,null,null,null,"Supporting Performance: Front of House","Performing Arts Production",27,"Supporting Performance: Front of House",30,"Internal"]
[null,null,null,null,null,null,"Make-up for Performance","Performing Arts Production",28,"Make-up for Performance",30,"Internal"]
[null,null,null,null,null,null,"Wardrobe for Stage Performance","Performing Arts Production",29,"Wardrobe for Stage Performance",30,"Internal"]
[null,null,null,null,null,null,"Planning and Managing a Performing Arts Event","Performing Arts Production",33,"Planning and Managing a Performing Arts Event",60,"Internal"]
[null,null,null,null,null,null,"Multimedia Production","Performing Arts Production",34,"Multimedia Production",60,"Internal"]
[null,null,null,null,null,null,"Use of ICT in the Performing Arts","Performing Arts Production",38,"Use of ICT in the Performing Arts",30,"Internal"]
[null,null,null,null,null,null,"Work Experience in the Performing Arts","Performing Arts Production",39,"Work Experience in the Performing Arts",30,"Internal"]
[null,null,null,null,null,null,"Employment in the Public Services","Public Services",3,"Employment in the Public Services",30,"Internal"]
[null,null,null,null,null,null,"Public Services and Community Protection","Public Services",4,"Public Services and Community Protection",30,"Internal"]
[null,null,null,null,null,null,"Health, Fitness and Lifestyle for the Public Services","Public Services",5,"Health, Fitness and Lifestyle for the Public Services",30,"Internal"]
[null,null,null,null,null,null,"Promotion of Public Services Provision","Public Services",8,"Promotion of Public Services Provision",30,"Internal"]
[null,null,null,null,null,null,"Community and Cultural Awareness","Public Services",9,"Community and Cultural Awareness",30,"Internal"]
[null,null,null,null,null,null,"Adventurous Activities in the Public Services","Public Services",10,"Adventurous Activities in the Public Services",30,"Internal"]
[null,null,null,null,null,null,"Sport and Recreation in the Public Services","Public Services",11,"Sport and Recreation in the Public Services",30,"Internal"]
[null,null,null,null,null,null,"Land Navigation by Map and Compass","Public Services",12,"Land Navigation by Map and Compass",60,"Internal"]
[null,null,null,null,null,null,"Volunteering for the Public Services","Public Services",13,"Volunteering for the Public Services",60,"Internal"]
[null,null,null,null,null,null,"Multi-day Expedition Experience","Public Services",14,"Multi-day Expedition Experience",60,"Internal"]
[null,null,null,null,null,null,"Health and Safety in the Public Services","Public Services",15,"Health and Safety in the Public Services",30,"Internal"]
[null,null,null,null,null,null,"Preparing to Respond to Emergency Incidents","Public Services",17,"Preparing to Respond to Emergency Incidents",60,"Internal"]
[null,null,null,null,null,null,"Security Procedures in the Public Services","Public Services",18,"Security Procedures in the Public Services",60,"Internal"]
[null,null,null,null,null,null,"Law and its Impact on the Individual","Public Services",20,"Law and its Impact on the Individual",60,"Internal"]
[null,null,null,null,null,null,"Designing Exercise Programmes","Sport",15,"Designing Exercise Programmes",60,"Internal"]
[null,null,null,null,null,null,"Facility Operations for Sport and Leisure","Sport",17,"Facility Operations for Sport and Leisure",60,"Internal"]
[null,null,null,null,null,null,"Expedition Experience","Sport",18,"Expedition Experience",60,"Internal"]
[null,null,null,null,null,null,"Practical Land-based Outdoor and Adventurous Activities","Sport",19,"Practical Land-based Outdoor and Adventurous Activities",60,"Internal"]
[null,null,null,null,null,null,"Practical Water-based Outdoor and Adventurous Activities","Sport",20,"Practical Water-based Outdoor and Adventurous Activities",60,"Internal"]
[null,null,null,null,null,null,"Land-based Outdoor and Adventurous Activity Leadership","Sport",21,"Land-based Outdoor and Adventurous Activity Leadership",60,"Internal"]
[null,null,null,null,null,null,"Water-based Outdoor and Adventurous Activity Leadership","Sport",22,"Water-based Outdoor and Adventurous Activity Leadership",60,"Internal"]
[null,null,null,null,null,null,"Work Experience in Sport","Sport",24,"Work Experience in Sport",60,"Internal"]
[null,null,null,null,null,null,"Expedition Experience","Sport Outdoor and Adventurous Activities",18,"Expedition Experience",60,"Internal"]
[null,null,null,null,null,null,"Practical Land-based Outdoor and Adventurous Activities","Sport Outdoor and Adventurous Activities",19,"Practical Land-based Outdoor and Adventurous Activities",60,"Internal"]
[null,null,null,null,null,null,"Practical Water-based Outdoor and Adventurous Activities","Sport Outdoor and Adventurous Activities",20,"Practical Water-based Outdoor and Adventurous Activities",60,"Internal"]
[null,null,null,null,null,null,"Land-based Outdoor and Adventurous Activity Leadership","Sport Outdoor and Adventurous Activities",21,"Land-based Outdoor and Adventurous Activity Leadership",60,"Internal"]
[null,null,null,null,null,null,"Water-based Outdoor and Adventurous Activity Leadership","Sport Outdoor and Adventurous Activities",22,"Water-based Outdoor and Adventurous Activity Leadership",60,"Internal"]
[null,null,null,null,null,null,"Facility Operations for Sport and Leisure","Sport Fitness and Exercise",17,"Facility Operations for Sport and Leisure",60,"Internal"]
[null,null,null,null,null,null,"Work Experience in Sport","Sport Fitness and Exercise",24,"Work Experience in Sport",60,"Internal"]
[null,null,null,null,null,null,"Promotion and Sales in Travel and Tourism","Travel and Tourism",8,"Promotion and Sales in Travel and Tourism",30,"Internal"]
[null,null,null,null,null,null,"Travel and Tourism Employment Opportunities","Travel and Tourism",9,"Travel and Tourism Employment Opportunities",30,"Internal"]
[null,null,null,null,null,null,"Organising a Travel and Tourism Study Visit","Travel and Tourism",10,"Organising a Travel and Tourism Study Visit",30,"Internal"]
[null,null,null,null,null,null,"Marketing in Travel and Tourism","Travel and Tourism",12,"Marketing in Travel and Tourism",60,"Internal"]
[null,null,null,null,null,null,"Airports and Airlines","Travel and Tourism",13,"Airports and Airlines",60,"Internal"]
[null,null,null,null,null,null,"Travel and Tourism Research Project","Travel and Tourism",14,"Travel and Tourism Research Project",60,"Internal"]
[null,null,null,null,null,null,"Work-related Experience in Travel and Tourism","Travel and Tourism",15,"Work-related Experience in Travel and Tourism",60,"Internal"]
[null,null,null,null,null,null,"Holiday Representatives","Travel and Tourism",16,"Holiday Representatives",30,"Internal"]
[null,null,null,null,null,null,"UK Travel Agency Operations","Travel and Tourism",17,"UK Travel Agency Operations",30,"Internal"]
[null,null,null,null,null,null,"The Cruise Industry","Travel and Tourism",18,"The Cruise Industry",30,"Internal"]
[null,null,null,null,null,null,"Hospitality Operations in the Travel and Tourism Sector","Travel and Tourism",19,"Hospitality Operations in the Travel and Tourism Sector",30,"Internal"]
[null,null,null,null,null,null,"UK Visitor Attractions","Travel and Tourism",20,"UK Visitor Attractions",30,"Internal"]
[null,null,null,null,null,null,"Overseas Holiday Operations","Travel and Tourism",21,"Overseas Holiday Operations",30,"Internal"]

{"sheet":"Diploma Dropdown","index":10,"n_rows":48,"n_cols":179,"rows_kept":48,"cut":false,"hidden":true,"merged":[]}
["Applied Science",null,null,null,"Art and Design",null,null,null,"Design Crafts",null,null,null,"Fashion and Textiles",null,null,null,"Photography",null,null,null,"Product Design",null,null,null,"Visual Arts",null,null,null,"Visual Communication",null,null,null,"Business",null,null,null,"construction and the Built Environment",null,null,null,"Creative Digital Media Production",null,null,null,"Engineering A",null,null,null,"Engineering B",null,null,null,"Eng Tech A",null,null,null,"Eng Tech B",null,null,null,"Eng Maint A",null,null,null,"Eng Maint B",null,null,null,"Eng Manu A",null,null,null,"Eng Manu B",null,null,null,"Eng Mech A",null,null,null,"Eng Mech B",null,null,null,"HSC A",null,null,null,"HSC B",null,null,null,"Hospitality",null,null,null,"I&CT A",null,null,null,"I&CT B",null,null,null,"Comp Science A",null,null,null,"Sys Deve And Support",null,null,null,"Music",null,null,null,"Performing Arts A",null,null,null,"Performing Arts B",null,null,null,"Acting A",null,null,null,"Acting B",null,null,null,"Dance A",null,null,null,"Dance B",null,null,null,"Production A",null,null,null,"Production B",null,null,null,"Public Services",null,null,null,"Sport A",null,null,null,"Sport B",null,null,null,"Outdoor and Adventurous Activities A",null,null,null,"Outdoor and Adventurous Activities B",null,null,null,"Fitness and Exercise A",null,null,null,"Fitness and Exercise B",null,null,null,"Travel and Tourism"]
["Practical Scientific Project",{"$f":"IF(COUNTIF(Diploma!$E$20:$E$83,A2)>=1,\"\",ROW())","v":2},{"$f":"IF(ROW(A2)-ROW(A$2)+1>COUNT(B$2:B$50),\"\",INDEX(A:A,SMALL(B$2:B$50,1+ROW(A2)-ROW(A$2))))","v":"Practical Scientific Project"},null,"Communicating Ideas in 2D",{"$f":"IF(OR(COUNTIF(Diploma!$E$20:$E$83,E2)>=1,COUNTIF(Diploma!$E$20:$E$83,E7)>=1,COUNTIF(Diploma!$E$20:$E$83,E9)>=1,COUNTIF(Diploma!$E$20:$E$83,E16)>=1),\"\",ROW())","v":2},{"$f":"IF(ROW(E2)-ROW(E$2)+1>COUNT(F$2:F$50),\"\",INDEX(E:E,SMALL(F$2:F$50,1+ROW(E2)-ROW(E$2))))","v":"Communicating Ideas in 2D"},null,"Communicating Ideas in 2D",{"$f":"IF(COUNTIF(Diploma!$E$20:$E$83,I2)>=1,\"\",ROW())","v":2},{"$f":"IF(ROW(I2)-ROW(I$2)+1>COUNT(J$2:J$50),\"\",INDEX(I:I,SMALL(J$2:J$50,1+ROW(I2)-ROW(I$2))))","v":"Communicating Ideas in 2D"},null,"Communicating Ideas in 2D",{"$f":"IF(COUNTIF(Diploma!$E$20:$E$83,M2)>=1,\"\",ROW())","v":2},{"$f":"IF(ROW(M2)-ROW(M$2)+1>COUNT(N$2:N$50),\"\",INDEX(M:M,SMALL(N$2:N$50,1+ROW(M2)-ROW(M$2))))","v":"Communicating Ideas in 2D"},null,"Communicating Ideas in 2D",{"$f":"IF(COUNTIF(Diploma!$E$20:$E$83,Q2)>=1,\"\",ROW())","v":2},{"$f":"IF(ROW(Q2)-ROW(Q$2)+1>COUNT(R$2:R$50),\"\",INDEX(Q:Q,SMALL(R$2:R$50,1+ROW(Q2)-ROW(Q$2))))","v":"Communicating Ideas in 2D"},null,"Communicating Ideas in 2D",{"$f":"IF(OR(COUNTIF(Diploma!$E$20:$E$83,U2)>=1,COUNTIF(Diploma!$E$20:$E$83,U6)>=1),\"\",ROW())","v":2},{"$f":"IF(ROW(U2)-ROW(U$2)+1>COUNT(V$2:V$50),\"\",INDEX(U:U,SMALL(V$2:V$50,1+ROW(U2)-ROW(U$2))))","v":"Communicating Ideas in 2D"},null,"Using Mobile Devices in Art and Design",{"$f":"IF(COUNTIF(Diploma!$E$20:$E$83,Y2)>=1,\"\",ROW())","v":2},{"$f":"IF(ROW(Y2)-ROW(Y$2)+1>COUNT(Z$2:Z$50),\"\",INDEX(Y:Y,SMALL(Z$2:Z$50,1+ROW(Y2)-ROW(Y$2))))","v":"Using Mobile Devices in Art and Design"},null,"Communicating Ideas in 3D",{"$f":"IF(COUNTIF(Diploma!$E$20:$E$83,AC2)>=1,\"\",ROW())","v":2},{"$f":"IF(ROW(AC2)-ROW(AC$2)+1>COUNT(AD$2:AD$50),\"\",INDEX(AC:AC,SMALL(AD$2:AD$50,1+ROW(AC2)-ROW(AC$2))))","v":"Communicating Ideas in 3D"},null,"Principles of Customer Services",{"$f":"IF(COUNTIF(Diploma!$E$20:$E$83,AG2)>=1,\"\",ROW())","v":2},{"$f":"IF(ROW(AG2)-ROW(AG$2)+1>COUNT(AH$2:AH$50),\"\",INDEX(AG:AG,SMALL(AH$2:AH$50,1+ROW(AG2)-ROW(AG$2))))","v":"Principles of Customer Services"},null,"Construction Drawing Techniques",{"$f":"IF(COUNTIF(Diploma!$E$20:$E$83,AK2)>=1,\"\",ROW())","v":2},{"$f":"IF(ROW(AK2)-ROW(AK$2)+1>COUNT(AL$2:AL$50),\"\",INDEX(AK:AK,SMALL(AL$2:AL$50,1+ROW(AK2)-ROW(AK$2))))","v":"Construction Drawing Techniques"},null,"Digital Moving Image Production",{"$f":"IF(COUNTIF(Diploma!$E$20:$E$83,AO2)>=1,\"\",ROW())","v":2},{"$f":"IF(ROW(AO2)-ROW(AO$2)+1>COUNT(AP$2:AP$50),\"\",INDEX(AO:AO,SMALL(AP$2:AP$50,1+ROW(AO2)-ROW(AO$2))))","v":"Digital Moving Image Production"},null,"Machining Techniques",{"$f":"IF(COUNTIF(Diploma!$E$20:$E$83,AS2)>=1,\"\",ROW())","v":2},{"$f":"IF(ROW(AS2)-ROW(AS$2)+1>COUNT(AT$2:AT$50),\"\",INDEX(AS:AS,SMALL(AT$2:AT$50,1+ROW(AS2)-ROW(AS$2))))","v":"Machining Techniques"},null,"Engineering Maintenance",{"$f":"IF(COUNTIF(Diploma!$E$20:$E$83,AW2)>=1,\"\",ROW())","v":2},{"$f":"IF(ROW(AW2)-ROW(AW$2)+1>COUNT(AX$2:AX$50),\"\",INDEX(AW:AW,SMALL(AX$2:AX$50,1+ROW(AW2)-ROW(AW$2))))","v":"Engineering Maintenance"},null,"Electronic Devices and Communication Applications",{"$f":"IF(COUNTIF(Diploma!$E$20:$E$83,BA2)>=1,\"\",ROW())","v":2},{"$f":"IF(ROW(BA2)-ROW(BA$2)+1>COUNT(BB$2:BB$50),\"\",INDEX(BA:BA,SMALL(BB$2:BB$50,1+ROW(BA2)-ROW(BA$2))))","v":"Electronic Devices and Communication Applications"},null,"Engineering Maintenance",{"$f":"IF(COUNTIF(Diploma!$E$20:$E$83,BE2)>=1,\"\",ROW())","v":2},{"$f":"IF(ROW(BE2)-ROW(BE$2)+1>COUNT(BF$2:BF$50),\"\",INDEX(BE:BE,SMALL(BF$2:BF$50,1+ROW(BE2)-ROW(BE$2))))","v":"Engineering Maintenance"},null,"Operation and Maintenance of Mechanical Systems and Components",{"$f":"IF(COUNTIF(Diploma!$E$20:$E$83,BI2)>=1,\"\",ROW())","v":2},{"$f":"IF(ROW(BI2)-ROW(BI$2)+1>COUNT(BJ$2:BJ$50),\"\",INDEX(BI:BI,SMALL(BJ$2:BJ$50,1+ROW(BI2)-ROW(BI$2))))","v":"Operation and Maintenance of Mechanical Systems and Components"},null,"Electronic Circuit Design and Construction",{"$f":"IF(COUNTIF(Diploma!$E$20:$E$83,BM2)>=1,\"\",ROW())","v":2},{"$f":"IF(ROW(BM2)-ROW(BM$2)+1>COUNT(BN$2:BN$50),\"\",INDEX(BM:BM,SMALL(BN$2:BN$50,1+ROW(BM2)-ROW(BM$2))))","v":"Electronic Circuit Design and Construction"},null,"Operating an Efficient Workplace",{"$f":"IF(COUNTIF(Diploma!$E$20:$E$83,BQ2)>=1,\"\",ROW())","v":2},{"$f":"IF(ROW(BQ2)-ROW(BQ$2)+1>COUNT(BR$2:BR$50),\"\",INDEX(BQ:BQ,SMALL(BR$2:BR$50,1+ROW(BQ2)-ROW(BQ$2))))","v":"Operating an Efficient Workplace"},null,"Engineering Maintenance",{"$f":"IF(COUNTIF(Diploma!$E$20:$E$83,BU2)>=1,\"\",ROW())","v":2},{"$f":"IF(ROW(BU2)-ROW(BU$2)+1>COUNT(BV$2:BV$50),\"\",INDEX(BU:BU,SMALL(BV$2:BV$50,1+ROW(BU2)-ROW(BU$2))))","v":"Engineering Maintenance"},null,"Machining Techniques",{"$f":"IF(COUNTIF(Diploma!$E$20:$E$83,BY2)>=1,\"\",ROW())","v":2},{"$f":"IF(ROW(BY2)-ROW(BY$2)+1>COUNT(BZ$2:BZ$50),\"\",INDEX(BY:BY,SMALL(BZ$2:BZ$50,1+ROW(BY2)-ROW(BY$2))))","v":"Machining Techniques"},null,"Engineering Maintenance",{"$f":"IF(COUNTIF(Diploma!$E$20:$E$83,CC2)>=1,\"\",ROW())","v":2},{"$f":"IF(ROW(CC2)-ROW(CC$2)+1>COUNT(CD$2:CD$50),\"\",INDEX(CC:CC,SMALL(CD$2:CD$50,1+ROW(CC2)-ROW(CC$2))))","v":"Engineering Maintenance"},null,"Human Body Systems and Care of Disorders",{"$f":"IF(COUNTIF(Diploma!$E$20:$E$83,CG2)>=1,\"\",ROW())","v":2},{"$f":"IF(ROW(CG2)-ROW(CG$2)+1>COUNT(CH$2:CH$50),\"\",INDEX(CG:CG,SMALL(CH$2:CH$50,1+ROW(CG2)-ROW(CG$2))))","v":"Human Body Systems and Care of Disorders"},null,"Social Influences on Health and Wellbeing",{"$f":"IF(COUNTIF(Diploma!$E$20:$E$83,CK2)>=1,\"\",ROW())","v":2},{"$f":"IF(ROW(CK2)-ROW(CK$2)+1>COUNT(CL$2:CL$50),\"\",INDEX(CK:CK,SMALL(CL$2:CL$50,1+ROW(CK2)-ROW(CK$2))))","v":"Social Influences on Health and Wellbeing"},null,"Costing and Controlling Finances in the Hospitality Industry",{"$f":"IF(COUNTIF(Diploma!$E$20:$E$83,CO2)>=1,\"\",ROW())","v":2},{"$f":"IF(ROW(CO2)-ROW(CO$2)+1>COUNT(CP$2:CP$50),\"\",INDEX(CO:CO,SMALL(CP$2:CP$50,1+ROW(CO2)-ROW(CO$2))))","v":"Costing and Controlling Finances in the Hospitality Industry"},null,"Database Development",{"$f":"IF(COUNTIF(Diploma!$E$20:$E$83,CS2)>=1,\"\",ROW())","v":2},{"$f":"IF(ROW(CS2)-ROW(CS$2)+1>COUNT(CT$2:CT$50),\"\",INDEX(CS:CS,SMALL(CT$2:CT$50,1+ROW(CS2)-ROW(CS$2))))","v":"Database Development"},null,"Creating Digital Animation",{"$f":"IF(COUNTIF(Diploma!$E$20:$E$83,CW2)>=1,\"\",ROW())","v":2},{"$f":"IF(ROW(CW2)-ROW(CW$2)+1>COUNT(CX$2:CX$50),\"\",INDEX(CW:CW,SMALL(CX$2:CX$50,1+ROW(CW2)-ROW(CW$2))))","v":"Creating Digital Animation"},null,"Creating Digital Animation",{"$f":"IF(COUNTIF(Diploma!$E$20:$E$83,DA2)>=1,\"\",ROW())","v":2},{"$f":"IF(ROW(DA2)-ROW(DA$2)+1>COUNT(DB$2:DB$50),\"\",INDEX(DA:DA,SMALL(DB$2:DB$50,1+ROW(DA2)-ROW(DA$2))))","v":"Creating Digital Animation"},null,"Creating Digital Animation",{"$f":"IF(COUNTIF(Diploma!$E$20:$E$83,DE2)>=1,\"\",ROW())","v":2},{"$f":"IF(ROW(DE2)-ROW(DE$2)+1>COUNT(DF$2:DF$50),\"\",INDEX(DE:DE,SMALL(DF$2:DF$50,1+ROW(DE2)-ROW(DE$2))))","v":"Creating Digital Animation"},null,"Introducing Live Sound",{"$f":"IF(COUNTIF(Diploma!$E$20:$E$83,DI2)>=1,\"\",ROW())","v":2},{"$f":"IF(ROW(DI2)-ROW(DI$2)+1>COUNT(DJ$2:DJ$50),\"\",INDEX(DI:DI,SMALL(DJ$2:DJ$50,1+ROW(DI2)-ROW(DI$2))))","v":"Introducing Live Sound"},null,"Acting Skills",{"$f":"IF(COUNTIF(Diploma!$E$20:$E$83,DM2)>=1,\"\",ROW())","v":2},{"$f":"IF(ROW(DM2)-ROW(DM$2)+1>COUNT(DN$2:DN$50),\"\",INDEX(DM:DM,SMALL(DN$2:DN$50,1+ROW(DM2)-ROW(DM$2))))","v":"Acting Skills"},null,"Movement Skills",{"$f":"IF(COUNTIF(Diploma!$E$20:$E$83,DQ2)>=1,\"\",ROW())","v":2},{"$f":"IF(ROW(DQ2)-ROW(DQ$2)+1>COUNT(DR$2:DR$50),\"\",INDEX(DQ:DQ,SMALL(DR$2:DR$50,1+ROW(DQ2)-ROW(DQ$2))))","v":"Movement Skills"},null,"Movement Skills",{"$f":"IF(COUNTIF(Diploma!$E$20:$E$83,DU2)>=1,\"\",ROW())","v":2},{"$f":"IF(ROW(DU2)-ROW(DU$2)+1>COUNT(DV$2:DV$50),\"\",INDEX(DU:DU,SMALL(DV$2:DV$50,1+ROW(DU2)-ROW(DU$2))))","v":"Movement Skills"},null,"Contemporary Dance Techniques",{"$f":"IF(COUNTIF(Diploma!$E$20:$E$83,DY2)>=1,\"\",ROW())","v":2},{"$f":"IF(ROW(DY2)-ROW(DY$2)+1>COUNT(DZ$2:DZ$50),\"\",INDEX(DY:DY,SMALL(DZ$2:DZ$50,1+ROW(DY2)-ROW(DY$2))))","v":"Contemporary Dance Techniques"},null,"Movement Skills",{"$f":"IF(COUNTIF(Diploma!$E$20:$E$83,EC2)>=1,\"\",ROW())","v":2},{"$f":"IF(ROW(EC2)-ROW(EC$2)+1>COUNT(ED$2:ED$50),\"\",INDEX(EC:EC,SMALL(ED$2:ED$50,1+ROW(EC2)-ROW(EC$2))))","v":"Movement Skills"},null,"Voice and Speech for Performers",{"$f":"IF(COUNTIF(Diploma!$E$20:$E$83,EG2)>=1,\"\",ROW())","v":2},{"$f":"IF(ROW(EG2)-ROW(EG$2)+1>COUNT(EH$2:EH$50),\"\",INDEX(EG:EG,SMALL(EH$2:EH$50,1+ROW(EG2)-ROW(EG$2))))","v":"Voice and Speech for Performers"},null,"Design Planning for Performance",{"$f":"IF(COUNTIF(Diploma!$E$20:$E$83,EK2)>=1,\"\",ROW())","v":2},{"$f":"IF(ROW(EK2)-ROW(EK$2)+1>COUNT(EL$2:EL$50),\"\",INDEX(EK:EK,SMALL(EL$2:EL$50,1+ROW(EK2)-ROW(EK$2))))","v":"Design Planning for Performance"},null,"Movement Skills",{"$f":"IF(COUNTIF(Diploma!$E$20:$E$83,EO2)>=1,\"\",ROW())","v":2},{"$f":"IF(ROW(EO2)-ROW(EO$2)+1>COUNT(EP$2:EP$50),\"\",INDEX(EO:EO,SMALL(EP$2:EP$50,1+ROW(EO2)-ROW(EO$2))))","v":"Movement Skills"},null,"Employment in the Public Services",{"$f":"IF(COUNTIF(Diploma!$E$20:$E$83,ES2)>=1,\"\",ROW())","v":2},{"$f":"IF(ROW(ES2)-ROW(ES$2)+1>COUNT(ET$2:ET$50),\"\",INDEX(ES:ES,SMALL(ET$2:ET$50,1+ROW(ES2)-ROW(ES$2))))","v":"Employment in the Public Services"},null,"Designing Exercise Programmes",{"$f":"IF(COUNTIF(Diploma!$E$20:$E$83,EW2)>=1,\"\",ROW())","v":2},{"$f":"IF(ROW(EW2)-ROW(EW$2)+1>COUNT(EX$2:EX$50),\"\",INDEX(EW:EW,SMALL(EX$2:EX$50,1+ROW(EW2)-ROW(EW$2))))","v":"Designing Exercise Programmes"},null,"Leading Sports Activities",{"$f":"IF(COUNTIF(Diploma!$E$20:$E$83,FA2)>=1,\"\",ROW())","v":2},{"$f":"IF(ROW(FA2)-ROW(FA$2)+1>COUNT(FB$2:FB$50),\"\",INDEX(FA:FA,SMALL(FB$2:FB$50,1+ROW(FA2)-ROW(FA$2))))","v":"Leading Sports Activities"},null,"Expedition Experience",{"$f":"IF(COUNTIF(Diploma!$E$20:$E$83,FE2)>=1,\"\",ROW())","v":2},{"$f":"IF(ROW(FE2)-ROW(FE$2)+1>COUNT(FF$2:FF$50),\"\",INDEX(FE:FE,SMALL(FF$2:FF$50,1+ROW(FE2)-ROW(FE$2))))","v":"Expedition Experience"},null,"Leading Sports Activities",{"$f":"IF(COUNTIF(Diploma!$E$20:$E$83,FI2)>=1,\"\",ROW())","v":2},{"$f":"IF(ROW(FI2)-ROW(FI$2)+1>COUNT(FJ$2:FJ$50),\"\",INDEX(FI:FI,SMALL(FJ$2:FJ$50,1+ROW(FI2)-ROW(FI$2))))","v":"Leading Sports Activities"},null,"Facility Operations for Sport and Leisure",{"$f":"IF(COUNTIF(Diploma!$E$20:$E$83,FM2)>=1,\"\",ROW())","v":2},{"$f":"IF(ROW(FM2)-ROW(FM$2)+1>COUNT(FN$2:FN$50),\"\",INDEX(FM:FM,SMALL(FN$2:FN$50,1+ROW(FM2)-ROW(FM$2))))","v":"Facility Operations for Sport and Leisure"},null,"Leading Sports Activities",{"$f":"IF(COUNTIF(Diploma!$E$20:$E$83,FQ2)>=1,\"\",ROW())","v":2},{"$f":"IF(ROW(FQ2)-ROW(FQ$2)+1>COUNT(FR$2:FR$50),\"\",INDEX(FQ:FQ,SMALL(FR$2:FR$50,1+ROW(FQ2)-ROW(FQ$2))))","v":"Leading Sports Activities"},null,"Promotion and Sales in Travel and Tourism",{"$f":"IF(COUNTIF(Diploma!$E$20:$E$83,FU2)>=1,\"\",ROW())","v":2},{"$f":"IF(ROW(FU2)-ROW(FU$2)+1>COUNT(FV$2:FV$50),\"\",INDEX(FU:FU,SMALL(FV$2:FV$50,1+ROW(FU2)-ROW(FU$2))))","v":"Promotion and Sales in Travel and Tourism"}]
["World Energy",{"$f":"IF(COUNTIF(Diploma!$E$20:$E$83,A3)>=1,\"\",ROW())","v":3},{"$f":"IF(ROW(A3)-ROW(A$2)+1>COUNT(B$2:B$50),\"\",INDEX(A:A,SMALL(B$2:B$50,1+ROW(A3)-ROW(A$2))))","v":"World Energy"},null,"Communicating Ideas in 3D",{"$f":"IF(OR(COUNTIF(Diploma!$E$20:$E$83,E3)>=1,COUNTIF(Diploma!$E$20:$E$83,E5)>=1,COUNTIF(Diploma!$E$20:$E$83,E9)>=1,COUNTIF(Diploma!$E$20:$E$83,E13)>=1,COUNTIF(Diploma!$E$20:$E$83,E17)>=1,COUNTIF(Diploma!$E$20:$E$83,E34)>=1),\"\",ROW())","v":3},{"$f":"IF(ROW(E3)-ROW(E$2)+1>COUNT(F$2:F$50),\"\",INDEX(E:E,SMALL(F$2:F$50,1+ROW(E3)-ROW(E$2))))","v":"Communicating Ideas in 3D"},null,"Art, Craft and Design in the Creative Industries",{"$f":"IF(COUNTIF(Diploma!$E$20:$E$83,I3)>=1,\"\",ROW())","v":3},{"$f":"IF(ROW(I3)-ROW(I$2)+1>COUNT(J$2:J$50),\"\",INDEX(I:I,SMALL(J$2:J$50,1+ROW(I3)-ROW(I$2))))","v":"Art, Craft and Design in the Creative Industries"},null,"Design Crafts Briefs",{"$f":"IF(COUNTIF(Diploma!$E$20:$E$83,M3)>=1,\"\",ROW())","v":3},{"$f":"IF(ROW(M3)-ROW(M$2)+1>COUNT(N$2:N$50),\"\",INDEX(M:M,SMALL(N$2:N$50,1+ROW(M3)-ROW(M$2))))","v":"Design Crafts Briefs"},null,"Communicating Ideas in 3D",{"$f":"IF(COUNTIF(Diploma!$E$20:$E$83,Q3)>=1,\"\",ROW())","v":3},{"$f":"IF(ROW(Q3)-ROW(Q$2)+1>COUNT(R$2:R$50),\"\",INDEX(Q:Q,SMALL(R$2:R$50,1+ROW(Q3)-ROW(Q$2))))","v":"Communicating Ideas in 3D"},null,"Communicating Ideas in 3D",{"$f":"IF(OR(COUNTIF(Diploma!$E$20:$E$83,U3)>=1,COUNTIF(Diploma!$E$20:$E$83,U9)>=1,COUNTIF(Diploma!$E$20:$E$83,U12)>=1),\"\",ROW())","v":3},{"$f":"IF(ROW(U3)-ROW(U$2)+1>COUNT(V$2:V$50),\"\",INDEX(U:U,SMALL(V$2:V$50,1+ROW(U3)-ROW(U$2))))","v":"Communicating Ideas in 3D"},null,"Photography Briefs",{"$f":"IF(COUNTIF(Diploma!$E$20:$E$83,Y3)>=1,\"\",ROW())","v":3},{"$f":"IF(ROW(Y3)-ROW(Y$2)+1>COUNT(Z$2:Z$50),\"\",INDEX(Y:Y,SMALL(Z$2:Z$50,1+ROW(Y3)-ROW(Y$2))))","v":"Photography Briefs"},null,"Using Mobile Devices in Art and Design",{"$f":"IF(COUNTIF(Diploma!$E$20:$E$83,AC3)>=1,\"\",ROW())","v":3},{"$f":"IF(ROW(AC3)-ROW(AC$2)+1>COUNT(AD$2:AD$50),\"\",INDEX(AC:AC,SMALL(AD$2:AD$50,1+ROW(AC3)-ROW(AC$2))))","v":"Using Mobile Devices in Art and Design"},null,"Sales and Personal Selling",{"$f":"IF(COUNTIF(Diploma!$E$20:$E$83,AG3)>=1,\"\",ROW())","v":3},{"$f":"IF(ROW(AG3)-ROW(AG$2)+1>COUNT(AH$2:AH$50),\"\",INDEX(AG:AG,SMALL(AH$2:AH$50,1+ROW(AG3)-ROW(AG$2))))","v":"Sales and Personal Selling"},null,"Exploring Carpentry and Joinery Principles and Techniques",{"$f":"IF(COUNTIF(Diploma!$E$20:$E$83,AK3)>=1,\"\",ROW())","v":3},{"$f":"IF(ROW(AK3)-ROW(AK$2)+1>COUNT(AL$2:AL$50),\"\",INDEX(AK:AK,SMALL(AL$2:AL$50,1+ROW(AK3)-ROW(AK$2))))","v":"Exploring Carpentry and Joinery Principles and Techniques"},null,"Digital Audio Production",{"$f":"IF(COUNTIF(Diploma!$E$20:$E$83,AO3)>=1,\"\",ROW())","v":3},{"$f":"IF(ROW(AO3)-ROW(AO$2)+1>COUNT(AP$2:AP$50),\"\",INDEX(AO:AO,SMALL(AP$2:AP$50,1+ROW(AO3)-ROW(AO$2))))","v":"Digital Audio Production"},null,"Electronic Circuit Design and Construction",{"$f":"IF(COUNTIF(Diploma!$E$20:$E$83,AS3)>=1,\"\",ROW())","v":3},{"$f":"IF(ROW(AS3)-ROW(AS$2)+1>COUNT(AT$2:AT$50),\"\",INDEX(AS:AS,SMALL(AT$2:AT$50,1+ROW(AS3)-ROW(AS$2))))","v":"Electronic Circuit Design and Construction"},null,"Computer-aided Engineering",{"$f":"IF(COUNTIF(Diploma!$E$20:$E$83,AW3)>=1,\"\",ROW())","v":3},{"$f":"IF(ROW(AW3)-ROW(AW$2)+1>COUNT(AX$2:AX$50),\"\",INDEX(AW:AW,SMALL(AX$2:AX$50,1+ROW(AW3)-ROW(AW$2))))","v":"Computer-aided Engineering"},null,"PC Software and Hardware in Engineering",{"$f":"IF(COUNTIF(Diploma!$E$20:$E$83,BA3)>=1,\"\",ROW())","v":3},{"$f":"IF(ROW(BA3)-ROW(BA$2)+1>COUNT(BB$2:BB$50),\"\",INDEX(BA:BA,SMALL(BB$2:BB$50,1+ROW(BA3)-ROW(BA$2))))","v":"PC Software and Hardware in Engineering"},null,"Computer-aided Engineering",{"$f":"IF(COUNTIF(Diploma!$E$20:$E$83,BE3)>=1,\"\",ROW())","v":3},{"$f":"IF(ROW(BE3)-ROW(BE$2)+1>COUNT(BF$2:BF$50),\"\",INDEX(BE:BE,SMALL(BF$2:BF$50,1+ROW(BE3)-ROW(BE$2))))","v":"Computer-aided Engineering"},null,"Operation and Maintenance of Electronic Systems and Components",{"$f":"IF(COUNTIF(Diploma!$E$20:$E$83,BI3)>=1,\"\",ROW())","v":3},{"$f":"IF(ROW(BI3)-ROW(BI$2)+1>COUNT(BJ$2:BJ$50),\"\",INDEX(BI:BI,SMALL(BJ$2:BJ$50,1+ROW(BI3)-ROW(BI$2))))","v":"Operation and Maintenance of Electronic Systems and Components"},null,"Electrical and Mechanical Science for Engineering",{"$f":"IF(COUNTIF(Diploma!$E$20:$E$83,BM3)>=1,\"\",ROW())","v":3},{"$f":"IF(ROW(BM3)-ROW(BM$2)+1>COUNT(BN$2:BN$50),\"\",INDEX(BM:BM,SMALL(BN$2:BN$50,1+ROW(BM3)-ROW(BM$2))))","v":"Electrical and Mechanical Science for Engineering"},null,"Continuous Improvement and Problem-Solving",{"$f":"IF(COUNTIF(Diploma!$E$20:$E$83,BQ3)>=1,\"\",ROW())","v":3},{"$f":"IF(ROW(BQ3)-ROW(BQ$2)+1>COUNT(BR$2:BR$50),\"\",INDEX(BQ:BQ,SMALL(BR$2:BR$50,1+ROW(BQ3)-ROW(BQ$2))))","v":"Continuous Improvement and Problem-Solving"},null,"Computer-aided Engineering",{"$f":"IF(COUNTIF(Diploma!$E$20:$E$83,BU3)>=1,\"\",ROW())","v":3},{"$f":"IF(ROW(BU3)-ROW(BU$2)+1>COUNT(BV$2:BV$50),\"\",INDEX(BU:BU,SMALL(BV$2:BV$50,1+ROW(BU3)-ROW(BU$2))))","v":"Computer-aided Engineering"},null,"Fabrication Techniques",{"$f":"IF(COUNTIF(Diploma!$E$20:$E$83,BY3)>=1,\"\",ROW())","v":3},{"$f":"IF(ROW(BY3)-ROW(BY$2)+1>COUNT(BZ$2:BZ$50),\"\",INDEX(BY:BY,SMALL(BZ$2:BZ$50,1+ROW(BY3)-ROW(BY$2))))","v":"Fabrication Techniques"},null,"Computer-aided Engineering",{"$f":"IF(COUNTIF(Diploma!$E$20:$E$83,CC3)>=1,\"\",ROW())","v":3},{"$f":"IF(ROW(CC3)-ROW(CC$2)+1>COUNT(CD$2:CD$50),\"\",INDEX(CC:CC,SMALL(CD$2:CD$50,1+ROW(CC3)-ROW(CC$2))))","v":"Computer-aided Engineering"},null,"Creative and Therapeutic Activities in Health and Social Care",{"$f":"IF(COUNTIF(Diploma!$E$20:$E$83,CG3)>=1,\"\",ROW())","v":3},{"$f":"IF(ROW(CG3)-ROW(CG$2)+1>COUNT(CH$2:CH$50),\"\",INDEX(CG:CG,SMALL(CH$2:CH$50,1+ROW(CG3)-ROW(CG$2))))","v":"Creative and Therapeutic Activities in Health and Social Care"},null,"Promoting Health and Wellbeing",{"$f":"IF(COUNTIF(Diploma!$E$20:$E$83,CK3)>=1,\"\",ROW())","v":3},{"$f":"IF(ROW(CK3)-ROW(CK$2)+1>COUNT(CL$2:CL$50),\"\",INDEX(CK:CK,SMALL(CL$2:CL$50,1+ROW(CK3)-ROW(CK$2))))","v":"Promoting Health and Wellbeing"},null,"Enterprise in the Hospitality Industry",{"$f":"IF(COUNTIF(Diploma!$E$20:$E$83,CO3)>=1,\"\",ROW())","v":3},"Enterprise in the Hospitality Industry",null,"Computer Networks",{"$f":"IF(COUNTIF(Diploma!$E$20:$E$83,CS3)>=1,\"\",ROW())","v":3},{"$f":"IF(ROW(CS3)-ROW(CS$2)+1>COUNT(CT$2:CT$50),\"\",INDEX(CS:CS,SMALL(CT$2:CT$50,1+ROW(CS3)-ROW(CS$2))))","v":"Computer Networks"},null,"Creating Digital Audio",{"$f":"IF(COUNTIF(Diploma!$E$20:$E$83,CW3)>=1,\"\",ROW())","v":3},{"$f":"IF(ROW(CW3)-ROW(CW$2)+1>COUNT(CX$2:CX$50),\"\",INDEX(CW:CW,SMALL(CX$2:CX$50,1+ROW(CW3)-ROW(CW$2))))","v":"Creating Digital Audio"},null,"Creating Digital Audio",{"$f":"IF(COUNTIF(Diploma!$E$20:$E$83,DA3)>=1,\"\",ROW())","v":3},{"$f":"IF(ROW(DA3)-ROW(DA$2)+1>COUNT(DB$2:DB$50),\"\",INDEX(DA:DA,SMALL(DB$2:DB$50,1+ROW(DA3)-ROW(DA$2))))","v":"Creating Digital Audio"},null,"Creating Digital Audio",{"$f":"IF(COUNTIF(Diploma!$E$20:$E$83,DE3)>=1,\"\",ROW())","v":3},{"$f":"IF(ROW(DE3)-ROW(DE$2)+1>COUNT(DF$2:DF$50),\"\",INDEX(DE:DE,SMALL(DF$2:DF$50,1+ROW(DE3)-ROW(DE$2))))","v":"Creating Digital Audio"},null,"Introducing Music Composition",{"$f":"IF(COUNTIF(Diploma!$E$20:$E$83,DI3)>=1,\"\",ROW())","v":3},{"$f":"IF(ROW(DI3)-ROW(DI$2)+1>COUNT(DJ$2:DJ$50),\"\",INDEX(DI:DI,SMALL(DJ$2:DJ$50,1+ROW(DI3)-ROW(DI$2))))","v":"Introducing Music Composition"},null,"Dance Skills",{"$f":"IF(COUNTIF(Diploma!$E$20:$E$83,DM3)>=1,\"\",ROW())","v":3},{"$f":"IF(ROW(DM3)-ROW(DM$2)+1>COUNT(DN$2:DN$50),\"\",INDEX(DM:DM,SMALL(DN$2:DN$50,1+ROW(DM3)-ROW(DM$2))))","v":"Dance Skills"},null,"Devising Performance Work",{"$f":"IF(COUNTIF(Diploma!$E$20:$E$83,DQ3)>=1,\"\",ROW())","v":3},{"$f":"IF(ROW(DQ3)-ROW(DQ$2)+1>COUNT(DR$2:DR$50),\"\",INDEX(DQ:DQ,SMALL(DR$2:DR$50,1+ROW(DQ3)-ROW(DQ$2))))","v":"Devising Performance Work"},null,"Devising Performance Work",{"$f":"IF(COUNTIF(Diploma!$E$20:$E$83,DU3)>=1,\"\",ROW())","v":3},{"$f":"IF(ROW(DU3)-ROW(DU$2)+1>COUNT(DV$2:DV$50),\"\",INDEX(DU:DU,SMALL(DV$2:DV$50,1+ROW(DU3)-ROW(DU$2))))","v":"Devising Performance Work"},null,"Exploring Urban Dance Styles",{"$f":"IF(COUNTIF(Diploma!$E$20:$E$83,DY3)>=1,\"\",ROW())","v":3},{"$f":"IF(ROW(DY3)-ROW(DY$2)+1>COUNT(DZ$2:DZ$50),\"\",INDEX(DY:DY,SMALL(DZ$2:DZ$50,1+ROW(DY3)-ROW(DY$2))))","v":"Exploring Urban Dance Styles"},null,"Devising Performance Work",{"$f":"IF(COUNTIF(Diploma!$E$20:$E$83,EC3)>=1,\"\",ROW())","v":3},{"$f":"IF(ROW(EC3)-ROW(EC$2)+1>COUNT(ED$2:ED$50),\"\",INDEX(EC:EC,SMALL(ED$2:ED$50,1+ROW(EC3)-ROW(EC$2))))","v":"Devising Performance Work"},null,"Performing Scripted Plays",{"$f":"IF(COUNTIF(Diploma!$E$20:$E$83,EG3)>=1,\"\",ROW())","v":3},{"$f":"IF(ROW(EG3)-ROW(EG$2)+1>COUNT(EH$2:EH$50),\"\",INDEX(EG:EG,SMALL(EH$2:EH$50,1+ROW(EG3)-ROW(EG$2))))","v":"Performing Scripted Plays"},null,"Realising Costume Design for Performance",{"$f":"IF(COUNTIF(Diploma!$E$20:$E$83,EK3)>=1,\"\",ROW())","v":3},{"$f":"IF(ROW(EK3)-ROW(EK$2)+1>COUNT(EL$2:EL$50),\"\",INDEX(EK:EK,SMALL(EL$2:EL$50,1+ROW(EK3)-ROW(EK$2))))","v":"Realising Costume Design for Performance"},null,"Devising Performance Work",{"$f":"IF(COUNTIF(Diploma!$E$20:$E$83,EO3)>=1,\"\",ROW())","v":3},{"$f":"IF(ROW(EO3)-ROW(EO$2)+1>COUNT(EP$2:EP$50),\"\",INDEX(EO:EO,SMALL(EP$2:EP$50,1+ROW(EO3)-ROW(EO$2))))","v":"Devising Performance Work"},null,"Public Services and Community Protection",{"$f":"IF(COUNTIF(Diploma!$E$20:$E$83,ES3)>=1,\"\",ROW())","v":3},{"$f":"IF(ROW(ES3)-ROW(ES$2)+1>COUNT(ET$2:ET$50),\"\",INDEX(ES:ES,SMALL(ET$2:ET$50,1+ROW(ES3)-ROW(ES$2))))","v":"Public Services and Community Protection"},null,"Facility Operations for Sport and Leisure",{"$f":"IF(COUNTIF(Diploma!$E$20:$E$83,EW3)>=1,\"\",ROW())","v":3},{"$f":"IF(ROW(EW3)-ROW(EW$2)+1>COUNT(EX$2:EX$50),\"\",INDEX(EW:EW,SMALL(EX$2:EX$50,1+ROW(EW3)-ROW(EW$2))))","v":"Facility Operations for Sport and Leisure"},null,"Promotion and Sponsorship in Sport",{"$f":"IF(COUNTIF(Diploma!$E$20:$E$83,FA3)>=1,\"\",ROW())","v":3},{"$f":"IF(ROW(FA3)-ROW(FA$2)+1>COUNT(FB$2:FB$50),\"\",INDEX(FA:FA,SMALL(FB$2:FB$50,1+ROW(FA3)-ROW(FA$2))))","v":"Promotion and Sponsorship in Sport"},null,"Practical Land-based Outdoor and Adventurous Activities",{"$f":"IF(COUNTIF(Diploma!$E$20:$E$83,FE3)>=1,\"\",ROW())","v":3},{"$f":"IF(ROW(FE3)-ROW(FE$2)+1>COUNT(FF$2:FF$50),\"\",INDEX(FE:FE,SMALL(FF$2:FF$50,1+ROW(FE3)-ROW(FE$2))))","v":"Practical Land-based Outdoor and Adventurous Activities"},null,"Promotion and Sponsorship in Sport",{"$f":"IF(COUNTIF(Diploma!$E$20:$E$83,FI3)>=1,\"\",ROW())","v":3},{"$f":"IF(ROW(FI3)-ROW(FI$2)+1>COUNT(FJ$2:FJ$50),\"\",INDEX(FI:FI,SMALL(FJ$2:FJ$50,1+ROW(FI3)-ROW(FI$2))))","v":"Promotion and Sponsorship in Sport"},null,"Work Experience in Sport",{"$f":"IF(COUNTIF(Diploma!$E$20:$E$83,FM3)>=1,\"\",ROW())","v":3},{"$f":"IF(ROW(FM3)-ROW(FM$2)+1>COUNT(FN$2:FN$50),\"\",INDEX(FM:FM,SMALL(FN$2:FN$50,1+ROW(FM3)-ROW(FM$2))))","v":"Work Experience in Sport"},null,"Promotion and Sponsorship in Sport",{"$f":"IF(COUNTIF(Diploma!$E$20:$E$83,FQ3)>=1,\"\",ROW())","v":3},{"$f":"IF(ROW(FQ3)-ROW(FQ$2)+1>COUNT(FR$2:FR$50),\"\",INDEX(FQ:FQ,SMALL(FR$2:FR$50,1+ROW(FQ3)-ROW(FQ$2))))","v":"Promotion and Sponsorship in Sport"},null,"Travel and Tourism Employment Opportunities",{"$f":"IF(COUNTIF(Diploma!$E$20:$E$83,FU3)>=1,\"\",ROW())","v":3},{"$f":"IF(ROW(FU3)-ROW(FU$2)+1>COUNT(FV$2:FV$50),\"\",INDEX(FU:FU,SMALL(FV$2:FV$50,1+ROW(FU3)-ROW(FU$2))))","v":"Travel and Tourism Employment Opportunities"}]
["How Scientific Theories are Formulated",{"$f":"IF(COUNTIF(Diploma!$E$20:$E$83,A4)>=1,\"\",ROW())","v":4},"How Scientific Theories are Formulated",null,"Using Mobile Devices in Art and Design",{"$f":"IF(COUNTIF(Diploma!$E$20:$E$83,E4)>=1,\"\",ROW())","v":4},"Using Mobile Devices in Art and Design",null,"3D Design Briefs",{"$f":"IF(COUNTIF(Diploma!$E$20:$E$83,I4)>=1,\"\",ROW())","v":4},"3D Design Briefs",null,"Photography Briefs",{"$f":"IF(COUNTIF(Diploma!$E$20:$E$83,M4)>=1,\"\",ROW())","v":4},"Photography Briefs",null,"Using Mobile Devices in Art and Design",{"$f":"IF(COUNTIF(Diploma!$E$20:$E$83,Q4)>=1,\"\",ROW())","v":4},"Using Mobile Devices in Art and Design",null,"Using Mobile Devices in Art and Design",{"$f":"IF(COUNTIF(Diploma!$E$20:$E$83,U4)>=1,\"\",ROW())","v":4},"Using Mobile Devices in Art and Design",null,"Art, Craft and Design in the Creative Industries",{"$f":"IF(COUNTIF(Diploma!$E$20:$E$83,Y4)>=1,\"\",ROW())","v":4},"Art, Craft and Design in the Creative Industries",null,"Fashion Briefs",{"$f":"IF(COUNTIF(Diploma!$E$20:$E$83,AC4)>=1,\"\",ROW())","v":4},"Fashion Briefs",null,"Introducing Retail Business",{"$f":"IF(COUNTIF(Diploma!$E$20:$E$83,AG4)>=1,\"\",ROW())","v":4},"Introducing Retail Business",null,"Exploring Brickwork and Blockwork Principles and Techniques",{"$f":"IF(COUNTIF(Diploma!$E$20:$E$83,AK4)>=1,\"\",ROW())","v":4},"Exploring Brickwork and Blockwork Principles and Techniques",null,"Digital Publishing Production",{"$f":"IF(COUNTIF(Diploma!$E$20:$E$83,AO4)>=1,\"\",ROW())","v":4},"Digital Publishing Production",null,"Engineering Design",{"$f":"IF(COUNTIF(Diploma!$E$20:$E$83,AS4)>=1,\"\",ROW())","v":4},{"$f":"IF(ROW(AS4)-ROW(AS$2)+1>COUNT(AT$2:AT$50),\"\",INDEX(AS:AS,SMALL(AT$2:AT$50,1+ROW(AS4)-ROW(AS$2))))","v":"Engineering Design"},null,"Electrical and Mechanical Science for Engineering",{"$f":"IF(COUNTIF(Diploma!$E$20:$E$83,AW4)>=1,\"\",ROW())","v":4},"Electrical and Mechanical Science for Engineering",null,null,null,null,null,"Electronic Circuit Design and Construction",{"$f":"IF(COUNTIF(Diploma!$E$20:$E$83,BE4)>=1,\"\",ROW())","v":4},"Electronic Circuit Design and Construction",null,"Operation and Maintenance of Electrical Systems and Components",{"$f":"IF(COUNTIF(Diploma!$E$20:$E$83,BI4)>=1,\"\",ROW())","v":4},{"$f":"IF(ROW(BI4)-ROW(BI$2)+1>COUNT(BJ$2:BJ$50),\"\",INDEX(BI:BI,SMALL(BJ$2:BJ$50,1+ROW(BI4)-ROW(BI$2))))","v":"Operation and Maintenance of Electrical Systems and Components"},null,"Engineering Assembly",{"$f":"IF(COUNTIF(Diploma!$E$20:$E$83,BM4)>=1,\"\",ROW())","v":4},"Engineering Assembly",null,"Electronic Devices and Communication Applications",{"$f":"IF(COUNTIF(Diploma!$E$20:$E$83,BQ4)>=1,\"\",ROW())","v":4},{"$f":"IF(ROW(BQ4)-ROW(BQ$2)+1>COUNT(BR$2:BR$50),\"\",INDEX(BQ:BQ,SMALL(BR$2:BR$50,1+ROW(BQ4)-ROW(BQ$2))))","v":"Electronic Devices and Communication Applications"},null,"Machining Techniques",{"$f":"IF(COUNTIF(Diploma!$E$20:$E$83,BU4)>=1,\"\",ROW())","v":4},"Machining Techniques",null,"Casting Techniques",{"$f":"IF(COUNTIF(Diploma!$E$20:$E$83,BY4)>=1,\"\",ROW())","v":4},{"$f":"IF(ROW(BY4)-ROW(BY$2)+1>COUNT(BZ$2:BZ$50),\"\",INDEX(BY:BY,SMALL(BZ$2:BZ$50,1+ROW(BY4)-ROW(BY$2))))","v":"Casting Techniques"},null,"Electrical and Mechanical Science for Engineering",{"$f":"IF(COUNTIF(Diploma!$E$20:$E$83,CC4)>=1,\"\",ROW())","v":4},"Electrical and Mechanical Science for Engineering",null,"Vocational Experience in Health and Social Care",{"$f":"IF(OR(COUNTIF(Diploma!$E$20:$E$83,CG4)>=1,COUNTIF(Diploma!$E$20:$E$83,CG5)>=1),\"\",ROW())","v":4},"Vocational Experience in Health and Social Care",null,"The Impact of Nutrition on Health and Wellbeing",{"$f":"IF(COUNTIF(Diploma!$E$20:$E$83,CK4)>=1,\"\",ROW())","v":4},"The Impact of Nutrition on Health and Wellbeing",null,"Planning, Preparing, Cooking and Finishing Food",{"$f":"IF(COUNTIF(Diploma!$E$20:$E$83,CO4)>=1,\"\",ROW())","v":4},"Planning, Preparing, Cooking and Finishing Food",null,"Software Development",{"$f":"IF(COUNTIF(Diploma!$E$20:$E$83,CS4)>=1,\"\",ROW())","v":4},"Software Development",null,"Creating Digital Graphics",{"$f":"IF(COUNTIF(Diploma!$E$20:$E$83,CW4)>=1,\"\",ROW())","v":4},"Creating Digital Graphics",null,"Creating Digital Graphics",{"$f":"IF(COUNTIF(Diploma!$E$20:$E$83,DA4)>=1,\"\",ROW())","v":4},"Creating Digital Graphics",null,"Creating Digital Graphics",{"$f":"IF(COUNTIF(Diploma!$E$20:$E$83,DE4)>=1,\"\",ROW())","v":4},"Creating Digital Graphics",null,"Introducing Music Performance",{"$f":"IF(COUNTIF(Diploma!$E$20:$E$83,DI4)>=1,\"\",ROW())","v":4},"Introducing Music Performance",null,"Musical Theatre Skills",{"$f":"IF(COUNTIF(Diploma!$E$20:$E$83,DM4)>=1,\"\",ROW())","v":4},{"$f":"IF(ROW(DM4)-ROW(DM$2)+1>COUNT(DN$2:DN$50),\"\",INDEX(DM:DM,SMALL(DN$2:DN$50,1+ROW(DM4)-ROW(DM$2))))","v":"Musical Theatre Skills"},null,"Exploring Improvisation",{"$f":"IF(COUNTIF(Diploma!$E$20:$E$83,DQ4)>=1,\"\",ROW())","v":4},"Exploring Improvisation",null,"Exploring Improvisation",{"$f":"IF(COUNTIF(Diploma!$E$20:$E$83,DU4)>=1,\"\",ROW())","v":4},"Exploring Improvisation",null,"Jazz Dance Techniques",{"$f":"IF(COUNTIF(Diploma!$E$20:$E$83,DY4)>=1,\"\",ROW())","v":4},"Jazz Dance Techniques",null,"Exploring Improvisation",{"$f":"IF(COUNTIF(Diploma!$E$20:$E$83,EC4)>=1,\"\",ROW())","v":4},"Exploring Improvisation",null,"Design Planning for Performance",{"$f":"IF(COUNTIF(Diploma!$E$20:$E$83,EG4)>=1,\"\",ROW())","v":4},"Design Planning for Performance",null,"Realising Set Design for Performance",{"$f":"IF(COUNTIF(Diploma!$E$20:$E$83,EK4)>=1,\"\",ROW())","v":4},"Realising Set Design for Performance",null,"Exploring Improvisation",{"$f":"IF(COUNTIF(Diploma!$E$20:$E$83,EO4)>=1,\"\",ROW())","v":4},"Exploring Improvisation",null,"Health, Fitness and Lifestyle for the Public Services",{"$f":"IF(COUNTIF(Diploma!$E$20:$E$83,ES4)>=1,\"\",ROW())","v":4},"Health, Fitness and Lifestyle for the Public Services",null,"Expedition Experience",{"$f":"IF(COUNTIF(Diploma!$E$20:$E$83,EW4)>=1,\"\",ROW())","v":4},"Expedition Experience",null,"Lifestyle and Well-being",{"$f":"IF(COUNTIF(Diploma!$E$20:$E$83,FA4)>=1,\"\",ROW())","v":4},"Lifestyle and Well-being",null,"Practical Water-based Outdoor and Adventurous Activities",{"$f":"IF(COUNTIF(Diploma!$E$20:$E$83,FE4)>=1,\"\",ROW())","v":4},{"$f":"IF(ROW(FE4)-ROW(FE$2)+1>COUNT(FF$2:FF$50),\"\",INDEX(FE:FE,SMALL(FF$2:FF$50,1+ROW(FE4)-ROW(FE$2))))","v":"Practical Water-based Outdoor and Adventurous Activities"},null,"Lifestyle and Well-being",{"$f":"IF(COUNTIF(Diploma!$E$20:$E$83,FI4)>=1,\"\",ROW())","v":4},"Lifestyle and Well-being",null,null,null,null,null,"Running a Sports Event",{"$f":"IF(COUNTIF(Diploma!$E$20:$E$83,FQ4)>=1,\"\",ROW())","v":4},"Running a Sports Event",null,"Organising a Travel and Tourism Study Visit",{"$f":"IF(COUNTIF(Diploma!$E$20:$E$83,FU4)>=1,\"\",ROW())","v":4},"Organising a Travel and Tourism Study Visit"]
["The Living Body",{"$f":"IF(COUNTIF(Diploma!$E$20:$E$83,A5)>=1,\"\",ROW())","v":5},"The Living Body",null,"Design Crafts Briefs",{"$f":"IF(OR(COUNTIF(Diploma!$E$20:$E$83,E5)>=1,COUNTIF(Diploma!$E$20:$E$83,E3)>=1),\"\",ROW())","v":5},"Design Crafts Briefs",null,"Designing Products",{"$f":"IF(COUNTIF(Diploma!$E$20:$E$83,I5)>=1,\"\",ROW())","v":5},"Designing Products",null,"Designing for the Future",{"$f":"IF(COUNTIF(Diploma!$E$20:$E$83,M5)>=1,\"\",ROW())","v":5},"Designing for the Future",null,"Art, Craft and Design in the Creative Industries",{"$f":"IF(COUNTIF(Diploma!$E$20:$E$83,Q5)>=1,\"\",ROW())","v":5},"Art, Craft and Design in the Creative Industries",null,"Fashion Briefs",{"$f":"IF(COUNTIF(Diploma!$E$20:$E$83,U5)>=1,\"\",ROW())","v":5},"Fashion Briefs",null,"Digital Art and Design Briefs",{"$f":"IF(COUNTIF(Diploma!$E$20:$E$83,Y5)>=1,\"\",ROW())","v":5},"Digital Art and Design Briefs",null,"Photography Briefs",{"$f":"IF(COUNTIF(Diploma!$E$20:$E$83,AC5)>=1,\"\",ROW())","v":5},"Photography Briefs",null,"Providing Business Support",{"$f":"IF(COUNTIF(Diploma!$E$20:$E$83,AG5)>=1,\"\",ROW())","v":5},"Providing Business Support",null,"Exploring Painting and Decorating Principles and Techniques",{"$f":"IF(COUNTIF(Diploma!$E$20:$E$83,AK5)>=1,\"\",ROW())","v":5},"Exploring Painting and Decorating Principles and Techniques",null,"Website Production",{"$f":"IF(COUNTIF(Diploma!$E$20:$E$83,AO5)>=1,\"\",ROW())","v":5},"Website Production",null,"Operating an Efficient Workplace",{"$f":"IF(COUNTIF(Diploma!$E$20:$E$83,AS5)>=1,\"\",ROW())","v":5},{"$f":"IF(ROW(AS5)-ROW(AS$2)+1>COUNT(AT$2:AT$50),\"\",INDEX(AS:AS,SMALL(AT$2:AT$50,1+ROW(AS5)-ROW(AS$2))))","v":"Operating an Efficient Workplace"},null,"Engineering Assembly",{"$f":"IF(COUNTIF(Diploma!$E$20:$E$83,AW5)>=1,\"\",ROW())","v":5},"Engineering Assembly",null,null,null,null,null,"Electrical and Mechanical Science for Engineering",{"$f":"IF(COUNTIF(Diploma!$E$20:$E$83,BE5)>=1,\"\",ROW())","v":5},"Electrical and Mechanical Science for Engineering",null,"Operation and Maintenance of Fluid Power Systems and Components",{"$f":"IF(COUNTIF(Diploma!$E$20:$E$83,BI5)>=1,\"\",ROW())","v":5},{"$f":"IF(ROW(BI5)-ROW(BI$2)+1>COUNT(BJ$2:BJ$50),\"\",INDEX(BI:BI,SMALL(BJ$2:BJ$50,1+ROW(BI5)-ROW(BI$2))))","v":"Operation and Maintenance of Fluid Power Systems and Components"},null,"Vehicle Engines and Other Systems",{"$f":"IF(COUNTIF(Diploma!$E$20:$E$83,BM5)>=1,\"\",ROW())","v":5},"Vehicle Engines and Other Systems",null,null,null,null,null,"Electrical and Mechanical Science for Engineering",{"$f":"IF(COUNTIF(Diploma!$E$20:$E$83,BU5)>=1,\"\",ROW())","v":5},"Electrical and Mechanical Science for Engineering",null,null,null,null,null,"Engineering Design",{"$f":"IF(COUNTIF(Diploma!$E$20:$E$83,CC5)>=1,\"\",ROW())","v":5},"Engineering Design",null,"Community Volunteering in Health and Social Care",{"$f":"IF(OR(COUNTIF(Diploma!$E$20:$E$83,CG5)>=1,COUNTIF(Diploma!$E$20:$E$83,CG4)>=1),\"\",ROW())","v":5},"Community Volunteering in Health and Social Care",null,"Services in Health and Social Care",{"$f":"IF(COUNTIF(Diploma!$E$20:$E$83,CK5)>=1,\"\",ROW())","v":5},"Services in Health and Social Care",null,"Food and Beverage Service in the Hospitality Industry",{"$f":"IF(COUNTIF(Diploma!$E$20:$E$83,CO5)>=1,\"\",ROW())","v":5},"Food and Beverage Service in the Hospitality Industry",null,"Website Development",{"$f":"IF(COUNTIF(Diploma!$E$20:$E$83,CS5)>=1,\"\",ROW())","v":5},"Website Development",null,"Creating Digital Video",{"$f":"IF(COUNTIF(Diploma!$E$20:$E$83,CW5)>=1,\"\",ROW())","v":5},"Creating Digital Video",null,"Creating Digital Video",{"$f":"IF(COUNTIF(Diploma!$E$20:$E$83,DA5)>=1,\"\",ROW())","v":5},"Creating Digital Video",null,"Creating Digital Video",{"$f":"IF(COUNTIF(Diploma!$E$20:$E$83,DE5)>=1,\"\",ROW())","v":5},"Creating Digital Video",null,"Introducing Music Recording",{"$f":"IF(COUNTIF(Diploma!$E$20:$E$83,DI5)>=1,\"\",ROW())","v":5},"Introducing Music Recording",null,"Music Performance Skills",{"$f":"IF(COUNTIF(Diploma!$E$20:$E$83,DM5)>=1,\"\",ROW())","v":5},{"$f":"IF(ROW(DM5)-ROW(DM$2)+1>COUNT(DN$2:DN$50),\"\",INDEX(DM:DM,SMALL(DN$2:DN$50,1+ROW(DM5)-ROW(DM$2))))","v":"Music Performance Skills"},null,"Multimedia Performance",{"$f":"IF(COUNTIF(Diploma!$E$20:$E$83,DQ5)>=1,\"\",ROW())","v":5},"Multimedia Performance",null,"Multimedia Performance",{"$f":"IF(COUNTIF(Diploma!$E$20:$E$83,DU5)>=1,\"\",ROW())","v":5},"Multimedia Performance",null,"Design Planning for Performance",{"$f":"IF(COUNTIF(Diploma!$E$20:$E$83,DY5)>=1,\"\",ROW())","v":5},"Design Planning for Performance",null,"Contemporary Dance Techniques",{"$f":"IF(COUNTIF(Diploma!$E$20:$E$83,EC5)>=1,\"\",ROW())","v":5},"Contemporary Dance Techniques",null,"Realising Costume Design for Performance",{"$f":"IF(COUNTIF(Diploma!$E$20:$E$83,EG5)>=1,\"\",ROW())","v":5},"Realising Costume Design for Performance",null,"Realising Prop Design for Performance",{"$f":"IF(COUNTIF(Diploma!$E$20:$E$83,EK5)>=1,\"\",ROW())","v":5},"Realising Prop Design for Performance",null,"Multimedia Performance",{"$f":"IF(COUNTIF(Diploma!$E$20:$E$83,EO5)>=1,\"\",ROW())","v":5},"Multimedia Performance",null,"Promotion of Public Services Provision",{"$f":"IF(COUNTIF(Diploma!$E$20:$E$83,ES5)>=1,\"\",ROW())","v":5},"Promotion of Public Services Provision",null,"Practical Land-based Outdoor and Adventurous Activities",{"$f":"IF(COUNTIF(Diploma!$E$20:$E$83,EW5)>=1,\"\",ROW())","v":5},"Practical Land-based Outdoor and Adventurous Activities",null,"Injury and the Sports Performer",{"$f":"IF(COUNTIF(Diploma!$E$20:$E$83,FA5)>=1,\"\",ROW())","v":5},"Injury and the Sports Performer",null,"Land-based Outdoor and Adventurous Activity Leadership",{"$f":"IF(COUNTIF(Diploma!$E$20:$E$83,FE5)>=1,\"\",ROW())","v":5},{"$f":"IF(ROW(FE5)-ROW(FE$2)+1>COUNT(FF$2:FF$50),\"\",INDEX(FE:FE,SMALL(FF$2:FF$50,1+ROW(FE5)-ROW(FE$2))))","v":"Land-based Outdoor and Adventurous Activity Leadership"},null,"Injury and the Sports Performer",{"$f":"IF(COUNTIF(Diploma!$E$20:$E$83,FI5)>=1,\"\",ROW())","v":5},"Injury and the Sports Performer",null,null,null,null,null,"The Sport and Active Leisure Industry",{"$f":"IF(COUNTIF(Diploma!$E$20:$E$83,FQ5)>=1,\"\",ROW())","v":5},"The Sport and Active Leisure Industry",null,"Marketing in Travel and Tourism",{"$f":"IF(COUNTIF(Diploma!$E$20:$E$83,FU5)>=1,\"\",ROW())","v":5},"Marketing in Travel and Tourism"]
["Monitoring the Environment",{"$f":"IF(COUNTIF(Diploma!$E$20:$E$83,A6)>=1,\"\",ROW())","v":6},"Monitoring the Environment",null,"Fashion Briefs",{"$f":"IF(COUNTIF(Diploma!$E$20:$E$83,E6)>=1,\"\",ROW())","v":6},"Fashion Briefs",null,"Printmaking Briefs",{"$f":"IF(COUNTIF(Diploma!$E$20:$E$83,I6)>=1,\"\",ROW())","v":6},"Printmaking Briefs",null,"Art, Craft and Design in the Creative Industries",{"$f":"IF(COUNTIF(Diploma!$E$20:$E$83,M6)>=1,\"\",ROW())","v":6},"Art, Craft and Design in the Creative Industries",null,"Digital Art and Design Briefs",{"$f":"IF(COUNTIF(Diploma!$E$20:$E$83,Q6)>=1,\"\",ROW())","v":6},"Digital Art and Design Briefs",null,"Graphic Design Briefs",{"$f":"IF(OR(COUNTIF(Diploma!$E$20:$E$83,U6)>=1,COUNTIF(Diploma!$E$20:$E$83,U2)>=1),\"\",ROW())","v":6},"Graphic Design Briefs",null,"Painting Briefs",{"$f":"IF(COUNTIF(Diploma!$E$20:$E$83,Y6)>=1,\"\",ROW())","v":6},"Painting Briefs",null,"Designing for the Future",{"$f":"IF(COUNTIF(Diploma!$E$20:$E$83,AC6)>=1,\"\",ROW())","v":6},"Designing for the Future",null,"Recruitment, Selection and Employment",{"$f":"IF(OR(COUNTIF(Diploma!$E$20:$E$83,AG6)>=1,COUNTIF(Diploma!$E$20:$E$83,AG19)>=1),\"\",ROW())","v":6},"Recruitment, Selection and Employment",null,"Exploring Plumbing Principles and Techniques",{"$f":"IF(COUNTIF(Diploma!$E$20:$E$83,AK6)>=1,\"\",ROW())","v":6},"Exploring Plumbing Principles and Techniques",null,"Digital Games Production",{"$f":"IF(COUNTIF(Diploma!$E$20:$E$83,AO6)>=1,\"\",ROW())","v":6},"Digital Games Production",null,"Computer Numerical Control Programming",{"$f":"IF(COUNTIF(Diploma!$E$20:$E$83,AS6)>=1,\"\",ROW())","v":6},{"$f":"IF(ROW(AS6)-ROW(AS$2)+1>COUNT(AT$2:AT$50),\"\",INDEX(AS:AS,SMALL(AT$2:AT$50,1+ROW(AS6)-ROW(AS$2))))","v":"Computer Numerical Control Programming"},null,"Vehicle Engines and Other Systems",{"$f":"IF(COUNTIF(Diploma!$E$20:$E$83,AW6)>=1,\"\",ROW())","v":6},"Vehicle Engines and Other Systems",null,null,null,null,null,"Engineering Design",{"$f":"IF(COUNTIF(Diploma!$E$20:$E$83,BE6)>=1,\"\",ROW())","v":6},"Engineering Design",null,null,null,null,null,"Bicycle Servicing and Maintenance",{"$f":"IF(COUNTIF(Diploma!$E$20:$E$83,BM6)>=1,\"\",ROW())","v":6},"Bicycle Servicing and Maintenance",null,null,null,null,null,"Engineering Design",{"$f":"IF(COUNTIF(Diploma!$E$20:$E$83,BU6)>=1,\"\",ROW())","v":6},"Engineering Design",null,null,null,null,null,"Engineering Assembly",{"$f":"IF(COUNTIF(Diploma!$E$20:$E$83,CC6)>=1,\"\",ROW())","v":6},"Engineering Assembly",null,"Child Development and Observation",{"$f":"IF(COUNTIF(Diploma!$E$20:$E$83,CG6)>=1,\"\",ROW())","v":6},"Child Development and Observation",null,"An Introduction to Basic First Aid",{"$f":"IF(COUNTIF(Diploma!$E$20:$E$83,CK6)>=1,\"\",ROW())","v":6},"An Introduction to Basic First Aid",null,"Front Office Services in the Hospitality Industry",{"$f":"IF(COUNTIF(Diploma!$E$20:$E$83,CO6)>=1,\"\",ROW())","v":6},"Front Office Services in the Hospitality Industry",null,"Installing and Maintaining Computer Hardware",{"$f":"IF(COUNTIF(Diploma!$E$20:$E$83,CS6)>=1,\"\",ROW())","v":6},"Installing and Maintaining Computer Hardware",null,"Mobile Apps Development",{"$f":"IF(COUNTIF(Diploma!$E$20:$E$83,CW6)>=1,\"\",ROW())","v":6},"Mobile Apps Development",null,"Mobile Apps Development",{"$f":"IF(COUNTIF(Diploma!$E$20:$E$83,DA6)>=1,\"\",ROW())","v":6},"Mobile Apps Development",null,"Mobile Apps Development",{"$f":"IF(COUNTIF(Diploma!$E$20:$E$83,DE6)>=1,\"\",ROW())","v":6},"Mobile Apps Development",null,"Introducing Music Sequencing",{"$f":"IF(COUNTIF(Diploma!$E$20:$E$83,DI6)>=1,\"\",ROW())","v":6},"Introducing Music Sequencing",null,"Production Skills for Performance",{"$f":"IF(COUNTIF(Diploma!$E$20:$E$83,DM6)>=1,\"\",ROW())","v":6},{"$f":"IF(ROW(DM6)-ROW(DM$2)+1>COUNT(DN$2:DN$50),\"\",INDEX(DM:DM,SMALL(DN$2:DN$50,1+ROW(DM6)-ROW(DM$2))))","v":"Production Skills for Performance"},null,"Voice and Speech for Performers",{"$f":"IF(COUNTIF(Diploma!$E$20:$E$83,DQ6)>=1,\"\",ROW())","v":6},"Voice and Speech for Performers",null,"Voice and Speech for Performers",{"$f":"IF(COUNTIF(Diploma!$E$20:$E$83,DU6)>=1,\"\",ROW())","v":6},"Voice and Speech for Performers",null,"Realising Costume Design for Performance",{"$f":"IF(COUNTIF(Diploma!$E$20:$E$83,DY6)>=1,\"\",ROW())","v":6},"Realising Costume Design for Performance",null,"Exploring Urban Dance Styles",{"$f":"IF(COUNTIF(Diploma!$E$20:$E$83,EC6)>=1,\"\",ROW())","v":6},"Exploring Urban Dance Styles",null,"Realising Set Design for Performance",{"$f":"IF(COUNTIF(Diploma!$E$20:$E$83,EG6)>=1,\"\",ROW())","v":6},"Realising Set Design for Performance",null,"Realising Mask Design for Performance",{"$f":"IF(COUNTIF(Diploma!$E$20:$E$83,EK6)>=1,\"\",ROW())","v":6},"Realising Mask Design for Performance",null,"Voice and Speech for Performers",{"$f":"IF(COUNTIF(Diploma!$E$20:$E$83,EO6)>=1,\"\",ROW())","v":6},"Voice and Speech for Performers",null,"Community and Cultural Awareness",{"$f":"IF(COUNTIF(Diploma!$E$20:$E$83,ES6)>=1,\"\",ROW())","v":6},"Community and Cultural Awareness",null,"Practical Water-based Outdoor and Adventurous Activities",{"$f":"IF(COUNTIF(Diploma!$E$20:$E$83,EW6)>=1,\"\",ROW())","v":6},"Practical Water-based Outdoor and Adventurous Activities",null,"Running a Sports Event",{"$f":"IF(COUNTIF(Diploma!$E$20:$E$83,FA6)>=1,\"\",ROW())","v":6},"Running a Sports Event",null,"Water-based Outdoor and Adventurous Activity Leadership",{"$f":"IF(COUNTIF(Diploma!$E$20:$E$83,FE6)>=1,\"\",ROW())","v":6},{"$f":"IF(ROW(FE6)-ROW(FE$2)+1>COUNT(FF$2:FF$50),\"\",INDEX(FE:FE,SMALL(FF$2:FF$50,1+ROW(FE6)-ROW(FE$2))))","v":"Water-based Outdoor and Adventurous Activity Leadership"},null,"Running a Sports Event",{"$f":"IF(COUNTIF(Diploma!$E$20:$E$83,FI6)>=1,\"\",ROW())","v":6},"Running a Sports Event",null,null,null,null,null,"Profiling Sports Performance",{"$f":"IF(COUNTIF(Diploma!$E$20:$E$83,FQ6)>=1,\"\",ROW())","v":6},"Profiling Sports Performance",null,"Airports and Airlines",{"$f":"IF(COUNTIF(Diploma!$E$20:$E$83,FU6)>=1,\"\",ROW())","v":6},"Airports and Airlines"]
["Growing Plants for Food",{"$f":"IF(COUNTIF(Diploma!$E$20:$E$83,A7)>=1,\"\",ROW())","v":7},"Growing Plants for Food",null,"Graphic Design Briefs",{"$f":"IF(OR(COUNTIF(Diploma!$E$20:$E$83,E7)>=1,COUNTIF(Diploma!$E$20:$E$83,E2)>=1),\"\",ROW())","v":7},"Graphic Design Briefs",null,"Drawing from Observation",{"$f":"IF(COUNTIF(Diploma!$E$20:$E$83,I7)>=1,\"\",ROW())","v":7},"Drawing from Observation",null,"Designing Products",{"$f":"IF(COUNTIF(Diploma!$E$20:$E$83,M7)>=1,\"\",ROW())","v":7},"Designing Products",null,"Moving Image Briefs",{"$f":"IF(COUNTIF(Diploma!$E$20:$E$83,Q7)>=1,\"\",ROW())","v":7},"Moving Image Briefs",null,"Textiles Briefs",{"$f":"IF(COUNTIF(Diploma!$E$20:$E$83,U7)>=1,\"\",ROW())","v":7},"Textiles Briefs",null,"Moving Image Briefs",{"$f":"IF(COUNTIF(Diploma!$E$20:$E$83,Y7)>=1,\"\",ROW())","v":7},"Moving Image Briefs",null,"Art, Craft and Design in the Creative Industries",{"$f":"IF(COUNTIF(Diploma!$E$20:$E$83,AC7)>=1,\"\",ROW())","v":7},"Art, Craft and Design in the Creative Industries",null,"Using Business Documentation",{"$f":"IF(COUNTIF(Diploma!$E$20:$E$83,AG7)>=1,\"\",ROW())","v":7},"Using Business Documentation",null,"Exploring Electrical Principles and Techniques",{"$f":"IF(COUNTIF(Diploma!$E$20:$E$83,AK7)>=1,\"\",ROW())","v":7},"Construction Drawing Techniques",null,"Digital Editing for Moving Image",{"$f":"IF(COUNTIF(Diploma!$E$20:$E$83,AO7)>=1,\"\",ROW())","v":7},"Digital Editing for Moving Image",null,null,null,null,null,"Vehicle Electrical Sytems",{"$f":"IF(COUNTIF(Diploma!$E$20:$E$83,AW7)>=1,\"\",ROW())","v":7},"Vehicle Electrical Sytems",null,null,null,null,null,"Computer Numerical Control Programming",{"$f":"IF(COUNTIF(Diploma!$E$20:$E$83,BE7)>=1,\"\",ROW())","v":7},"Computer Numerical Control Programming",null,null,null,null,null,"Electronic Devices and Communication Applications",{"$f":"IF(COUNTIF(Diploma!$E$20:$E$83,BM7)>=1,\"\",ROW())","v":7},"Electronic Devices and Communication Applications",null,null,null,null,null,"Engineering Assembly",{"$f":"IF(COUNTIF(Diploma!$E$20:$E$83,BU7)>=1,\"\",ROW())","v":7},"Engineering Assembly",null,null,null,null,null,"Vehicle Engines and Other Systems",{"$f":"IF(COUNTIF(Diploma!$E$20:$E$83,CC7)>=1,\"\",ROW())","v":7},"Vehicle Engines and Other Systems",null,"Skills and Qualities for Working in the Health and Social Care Sector",{"$f":"IF(COUNTIF(Diploma!$E$20:$E$83,CG7)>=1,\"\",ROW())","v":7},"Skills and Qualities for Working in the Health and Social Care Sector",null,"Food Safety in Health and Social Care",{"$f":"IF(COUNTIF(Diploma!$E$20:$E$83,CK7)>=1,\"\",ROW())","v":7},"Food Safety in Health and Social Care",null,"Marketing and Promotion in Hospitality",{"$f":"IF(COUNTIF(Diploma!$E$20:$E$83,CO7)>=1,\"\",ROW())","v":7},{"$f":"IF(ROW(CO7)-ROW(CO$2)+1>COUNT(CP$2:CP$50),\"\",INDEX(CO:CO,SMALL(CP$2:CP$50,1+ROW(CO7)-ROW(CO$2))))","v":"Marketing and Promotion in Hospitality"},null,"Installing and Maintaining Computer Software",{"$f":"IF(COUNTIF(Diploma!$E$20:$E$83,CS7)>=1,\"\",ROW())","v":7},"Installing and Maintaining Computer Software",null,"Spreadsheet Development",{"$f":"IF(COUNTIF(Diploma!$E$20:$E$83,CW7)>=1,\"\",ROW())","v":7},"Spreadsheet Development",null,"Spreadsheet Development",{"$f":"IF(COUNTIF(Diploma!$E$20:$E$83,DA7)>=1,\"\",ROW())","v":7},"Spreadsheet Development",null,"Spreadsheet Development",{"$f":"IF(COUNTIF(Diploma!$E$20:$E$83,DE7)>=1,\"\",ROW())","v":7},"Spreadsheet Development",null,"Introducing Choral Studies",{"$f":"IF(COUNTIF(Diploma!$E$20:$E$83,DI7)>=1,\"\",ROW())","v":7},"Introducing Choral Studies",null,null,null,null,null,"Performing Scripted Plays",{"$f":"IF(COUNTIF(Diploma!$E$20:$E$83,DQ7)>=1,\"\",ROW())","v":7},"Performing Scripted Plays",null,"Performing Scripted Plays",{"$f":"IF(COUNTIF(Diploma!$E$20:$E$83,DU7)>=1,\"\",ROW())","v":7},"Performing Scripted Plays",null,"Realising Set Design for Performance",{"$f":"IF(COUNTIF(Diploma!$E$20:$E$83,DY7)>=1,\"\",ROW())","v":7},"Realising Set Design for Performance",null,"Jazz Dance Techniques",{"$f":"IF(COUNTIF(Diploma!$E$20:$E$83,EC7)>=1,\"\",ROW())","v":7},"Jazz Dance Techniques",null,"Realising Prop Design for Performance",{"$f":"IF(COUNTIF(Diploma!$E$20:$E$83,EG7)>=1,\"\",ROW())","v":7},"Realising Prop Design for Performance",null,"Lighting for Performance",{"$f":"IF(COUNTIF(Diploma!$E$20:$E$83,EK7)>=1,\"\",ROW())","v":7},"Lighting for Performance",null,"Performing Scripted Plays",{"$f":"IF(COUNTIF(Diploma!$E$20:$E$83,EO7)>=1,\"\",ROW())","v":7},"Performing Scripted Plays",null,"Adventurous Activities in the Public Services",{"$f":"IF(OR(COUNTIF(Diploma!$E$20:$E$83,ES7)>=1,COUNTIF(Diploma!$E$20:$E$83,ES11)>=1),\"\",ROW())","v":7},"Adventurous Activities in the Public Services",null,"Land-based Outdoor and Adventurous Activity Leadership",{"$f":"IF(COUNTIF(Diploma!$E$20:$E$83,EW7)>=1,\"\",ROW())","v":7},"Land-based Outdoor and Adventurous Activity Leadership",null,"The Sport and Active Leisure Industry",{"$f":"IF(COUNTIF(Diploma!$E$20:$E$83,FA7)>=1,\"\",ROW())","v":7},"The Sport and Active Leisure Industry",null,null,null,null,null,"The Sport and Active Leisure Industry",{"$f":"IF(COUNTIF(Diploma!$E$20:$E$83,FI7)>=1,\"\",ROW())","v":7},"The Sport and Active Leisure Industry",null,null,null,null,null,"The Provision of Sport and Active Leisure",{"$f":"IF(COUNTIF(Diploma!$E$20:$E$83,FQ7)>=1,\"\",ROW())","v":7},"The Provision of Sport and Active Leisure",null,"Travel and Tourism Research Project",{"$f":"IF(COUNTIF(Diploma!$E$20:$E$83,FU7)>=1,\"\",ROW())","v":7},"Travel and Tourism Research Project"]
["Investigating a Crime Scene",{"$f":"IF(COUNTIF(Diploma!$E$20:$E$83,A8)>=1,\"\",ROW())","v":8},"Investigating a Crime Scene",null,"Textiles Briefs",{"$f":"IF(COUNTIF(Diploma!$E$20:$E$83,E8)>=1,\"\",ROW())","v":8},"Textiles Briefs",null,"Ceramics",{"$f":"IF(COUNTIF(Diploma!$E$20:$E$83,I8)>=1,\"\",ROW())","v":8},"Ceramics",null,"Fashion Promotion",{"$f":"IF(COUNTIF(Diploma!$E$20:$E$83,M8)>=1,\"\",ROW())","v":8},"Fashion Promotion",null,"Studio Photography",{"$f":"IF(COUNTIF(Diploma!$E$20:$E$83,Q8)>=1,\"\",ROW())","v":8},"Studio Photography",null,"Art, Craft and Design in the Creative Industries",{"$f":"IF(COUNTIF(Diploma!$E$20:$E$83,U8)>=1,\"\",ROW())","v":8},"Art, Craft and Design in the Creative Industries",null,"Printmaking Briefs",{"$f":"IF(COUNTIF(Diploma!$E$20:$E$83,Y8)>=1,\"\",ROW())","v":8},"Printmaking Briefs",null,"Digital Art and Design Briefs",{"$f":"IF(COUNTIF(Diploma!$E$20:$E$83,AC8)>=1,\"\",ROW())","v":8},"Digital Art and Design Briefs",null,"Building Successful Business Teams",{"$f":"IF(COUNTIF(Diploma!$E$20:$E$83,AG8)>=1,\"\",ROW())","v":8},"Building Successful Business Teams",null,"Exploring Roofing Principles and Techniques",{"$f":"IF(COUNTIF(Diploma!$E$20:$E$83,AK8)>=1,\"\",ROW())","v":8},"Exploring Carpentry and Joinery Principles and Techniques",null,"Digital Photography for a Media Product",{"$f":"IF(COUNTIF(Diploma!$E$20:$E$83,AO8)>=1,\"\",ROW())","v":8},"Digital Photography for a Media Product",null,null,null,null,null,"Welding",{"$f":"IF(COUNTIF(Diploma!$E$20:$E$83,AW8)>=1,\"\",ROW())","v":8},"Welding",null,null,null,null,null,"Sustainable Vehicle Power and Structure Design",{"$f":"IF(COUNTIF(Diploma!$E$20:$E$83,BE8)>=1,\"\",ROW())","v":8},"Sustainable Vehicle Power and Structure Design",null,null,null,null,null,"Vehicle Maintenance Techniques",{"$f":"IF(COUNTIF(Diploma!$E$20:$E$83,BM8)>=1,\"\",ROW())","v":8},"Vehicle Maintenance Techniques",null,null,null,null,null,"Welding",{"$f":"IF(COUNTIF(Diploma!$E$20:$E$83,BU8)>=1,\"\",ROW())","v":8},"Welding",null,null,null,null,null,"Welding",{"$f":"IF(COUNTIF(Diploma!$E$20:$E$83,CC8)>=1,\"\",ROW())","v":8},"Welding",null,"Understanding Disability",{"$f":"IF(COUNTIF(Diploma!$E$20:$E$83,CG8)>=1,\"\",ROW())","v":8},"Understanding Disability",null,"Infection Control in Health and Social Care",{"$f":"IF(COUNTIF(Diploma!$E$20:$E$83,CK8)>=1,\"\",ROW())","v":8},"Infection Control in Health and Social Care",null,"Accommodation Services in the Hospitality Industry",{"$f":"IF(COUNTIF(Diploma!$E$20:$E$83,CO8)>=1,\"\",ROW())","v":8},"Accommodation Services in the Hospitality Industry",null,"Automated Computer Systems",{"$f":"IF(COUNTIF(Diploma!$E$20:$E$83,CS8)>=1,\"\",ROW())","v":8},"Automated Computer Systems",null,"Building a Personal Computer",{"$f":"IF(COUNTIF(Diploma!$E$20:$E$83,CW8)>=1,\"\",ROW())","v":8},"Building a Personal Computer",null,"Database Development",{"$f":"IF(COUNTIF(Diploma!$E$20:$E$83,DA8)>=1,\"\",ROW())","v":8},"Database Development",null,"Database Development",{"$f":"IF(COUNTIF(Diploma!$E$20:$E$83,DE8)>=1,\"\",ROW())","v":8},"Database Development",null,"Introducing Music Theory",{"$f":"IF(COUNTIF(Diploma!$E$20:$E$83,DI8)>=1,\"\",ROW())","v":8},"Introducing Music Theory",null,null,null,null,null,"Contemporary Dance Techniques",{"$f":"IF(COUNTIF(Diploma!$E$20:$E$83,DQ8)>=1,\"\",ROW())","v":8},"Contemporary Dance Techniques",null,"Directing Performance",{"$f":"IF(COUNTIF(Diploma!$E$20:$E$83,DU8)>=1,\"\",ROW())","v":8},"Directing Performance",null,"Realising Prop Design for Performance",{"$f":"IF(COUNTIF(Diploma!$E$20:$E$83,DY8)>=1,\"\",ROW())","v":8},"Realising Prop Design for Performance",null,"Choreographing Dance",{"$f":"IF(COUNTIF(Diploma!$E$20:$E$83,EC8)>=1,\"\",ROW())","v":8},"Choreographing Dance",null,"Realising Mask Design for Performance",{"$f":"IF(COUNTIF(Diploma!$E$20:$E$83,EG8)>=1,\"\",ROW())","v":8},"Realising Mask Design for Performance",null,"Sound for Performance",{"$f":"IF(COUNTIF(Diploma!$E$20:$E$83,EK8)>=1,\"\",ROW())","v":8},"Sound for Performance",null,"Contemporary Dance Techniques",{"$f":"IF(COUNTIF(Diploma!$E$20:$E$83,EO8)>=1,\"\",ROW())","v":8},"Contemporary Dance Techniques",null,"Sport and Recreation in the Public Services",{"$f":"IF(COUNTIF(Diploma!$E$20:$E$83,ES8)>=1,\"\",ROW())","v":8},"Sport and Recreation in the Public Services",null,"Water-based Outdoor and Adventurous Activity Leadership",{"$f":"IF(COUNTIF(Diploma!$E$20:$E$83,EW8)>=1,\"\",ROW())","v":8},"Water-based Outdoor and Adventurous Activity Leadership",null,"Profiling Sports Performance",{"$f":"IF(COUNTIF(Diploma!$E$20:$E$83,FA8)>=1,\"\",ROW())","v":8},"Profiling Sports Performance",null,null,null,null,null,"Profiling Sports Performance",{"$f":"IF(COUNTIF(Diploma!$E$20:$E$83,FI8)>=1,\"\",ROW())","v":8},"Profiling Sports Performance",null,null,null,null,null,"Sport Community Volunteering",{"$f":"IF(COUNTIF(Diploma!$E$20:$E$83,FQ8)>=1,\"\",ROW())","v":8},"Sport Community Volunteering",null,"Work-related Experience in Travel and Tourism",{"$f":"IF(COUNTIF(Diploma!$E$20:$E$83,FU8)>=1,\"\",ROW())","v":8},"Work-related Experience in Travel and Tourism"]
["Science in Medicine",{"$f":"IF(COUNTIF(Diploma!$E$20:$E$83,A9)>=1,\"\",ROW())","v":9},"Science in Medicine",null,"Visual Arts Briefs",{"$f":"IF(OR(COUNTIF(Diploma!$E$20:$E$83,E9)>=1,COUNTIF(Diploma!$E$20:$E$83,E2)>=1,COUNTIF(Diploma!$E$20:$E$83,E3)>=1),\"\",ROW())","v":9},"Visual Arts Briefs",null,"Surface Design",{"$f":"IF(COUNTIF(Diploma!$E$20:$E$83,I9)>=1,\"\",ROW())","v":9},"Surface Design",null,"Printmaking Briefs",{"$f":"IF(COUNTIF(Diploma!$E$20:$E$83,M9)>=1,\"\",ROW())","v":9},"Printmaking Briefs",null,"Location Photography",{"$f":"IF(COUNTIF(Diploma!$E$20:$E$83,Q9)>=1,\"\",ROW())","v":9},"Location Photography",null,"3D Design Briefs",{"$f":"IF(OR(COUNTIF(Diploma!$E$20:$E$83,U9)>=1,COUNTIF(Diploma!$E$20:$E$83,U3)>=1),\"\",ROW())","v":9},"3D Design Briefs",null,"Drawing from Observation",{"$f":"IF(COUNTIF(Diploma!$E$20:$E$83,Y9)>=1,\"\",ROW())","v":9},"Drawing from Observation",null,"Interactive Media Production Briefs",{"$f":"IF(COUNTIF(Diploma!$E$20:$E$83,AC9)>=1,\"\",ROW())","v":9},"Interactive Media Production Briefs",null,"Introducing Law and Consumer Rights",{"$f":"IF(COUNTIF(Diploma!$E$20:$E$83,AG9)>=1,\"\",ROW())","v":9},"Introducing Law and Consumer Rights",null,"Exploring Wall and Floor Tiling Principles and Techniques",{"$f":"IF(COUNTIF(Diploma!$E$20:$E$83,AK9)>=1,\"\",ROW())","v":9},"Exploring Brickwork and Blockwork Principles and Techniques",null,"Animation for Digital Media",{"$f":"IF(COUNTIF(Diploma!$E$20:$E$83,AO9)>=1,\"\",ROW())","v":9},"Animation for Digital Media",null,null,null,null,null,"Bicycle Servicing and Maintenance",{"$f":"IF(COUNTIF(Diploma!$E$20:$E$83,AW9)>=1,\"\",ROW())","v":9},"Bicycle Servicing and Maintenance",null,null,null,null,null,null,null,null,null,null,null,null,null,null,null,null,null,null,null,null,null,"Computer Numerical Control Programming",{"$f":"IF(COUNTIF(Diploma!$E$20:$E$83,BU9)>=1,\"\",ROW())","v":9},"Computer Numerical Control Programming",null,null,null,null,null,"Computer Numerical Control Programming",{"$f":"IF(COUNTIF(Diploma!$E$20:$E$83,CC9)>=1,\"\",ROW())","v":9},"Computer Numerical Control Programming",null,"Introduction to Dementia",{"$f":"IF(COUNTIF(Diploma!$E$20:$E$83,CG9)>=1,\"\",ROW())","v":9},"Introduction to Dementia",null,"Using ICT in Health and Social Care",{"$f":"IF(COUNTIF(Diploma!$E$20:$E$83,CK9)>=1,\"\",ROW())","v":9},"Using ICT in Health and Social Care",null,"Planning and Running a Hospitality Event",{"$f":"IF(COUNTIF(Diploma!$E$20:$E$83,CO9)>=1,\"\",ROW())","v":9},"Planning and Running a Hospitality Event",null,"A Technology Business",{"$f":"IF(COUNTIF(Diploma!$E$20:$E$83,CS9)>=1,\"\",ROW())","v":9},"A Technology Business",null,"IT Work Experience",{"$f":"IF(COUNTIF(Diploma!$E$20:$E$83,CW9)>=1,\"\",ROW())","v":9},"IT Work Experience",null,"Computer Networks",{"$f":"IF(COUNTIF(Diploma!$E$20:$E$83,DA9)>=1,\"\",ROW())","v":9},"Computer Networks",null,"Software Development",{"$f":"IF(COUNTIF(Diploma!$E$20:$E$83,DE9)>=1,\"\",ROW())","v":9},"Software Development",null,"Developing Solo Music Performance",{"$f":"IF(COUNTIF(Diploma!$E$20:$E$83,DI9)>=1,\"\",ROW())","v":9},"Developing Solo Music Performance",null,null,null,null,null,"Exploring Urban Dance Styles",{"$f":"IF(COUNTIF(Diploma!$E$20:$E$83,DQ9)>=1,\"\",ROW())","v":9},"Exploring Urban Dance Styles",null,"Planning and Managing a Performing Arts Event",{"$f":"IF(COUNTIF(Diploma!$E$20:$E$83,DU9)>=1,\"\",ROW())","v":9},"Planning and Managing a Performing Arts Event",null,"Realising Mask Design for Performance",{"$f":"IF(COUNTIF(Diploma!$E$20:$E$83,DY9)>=1,\"\",ROW())","v":9},"Realising Mask Design for Performance",null,"Physical Theatre Performance",{"$f":"IF(COUNTIF(Diploma!$E$20:$E$83,EC9)>=1,\"\",ROW())","v":9},"Physical Theatre Performance",null,"Lighting for Performance",{"$f":"IF(COUNTIF(Diploma!$E$20:$E$83,EG9)>=1,\"\",ROW())","v":9},"Lighting for Performance",null,"Supporting Performance: Stage Management",{"$f":"IF(COUNTIF(Diploma!$E$20:$E$83,EK9)>=1,\"\",ROW())","v":9},"Supporting Performance: Stage Management",null,"Exploring Urban Dance Styles",{"$f":"IF(COUNTIF(Diploma!$E$20:$E$83,EO9)>=1,\"\",ROW())","v":9},"Exploring Urban Dance Styles",null,"Land Navigation by Map and Compass",{"$f":"IF(COUNTIF(Diploma!$E$20:$E$83,ES9)>=1,\"\",ROW())","v":9},"Land Navigation by Map and Compass",null,"Work Experience in Sport",{"$f":"IF(COUNTIF(Diploma!$E$20:$E$83,EW9)>=1,\"\",ROW())","v":9},"Work Experience in Sport",null,"The Provision of Sport and Active Leisure",{"$f":"IF(COUNTIF(Diploma!$E$20:$E$83,FA9)>=1,\"\",ROW())","v":9},"The Provision of Sport and Active Leisure",null,null,null,null,null,"Designing Exercise Programmes",{"$f":"IF(COUNTIF(Diploma!$E$20:$E$83,FI9)>=1,\"\",ROW())","v":9},"Designing Exercise Programmes",null,null,null,null,null,null,null,null,null,"Holiday Representatives",{"$f":"IF(COUNTIF(Diploma!$E$20:$E$83,FU9)>=1,\"\",ROW())","v":9},"Holiday Representatives"]
["Understanding Human Behaviour",{"$f":"IF(COUNTIF(Diploma!$E$20:$E$83,A10)>=1,\"\",ROW())","v":10},"Understanding Human Behaviour",null,"Photography Briefs",{"$f":"IF(COUNTIF(Diploma!$E$20:$E$83,E10)>=1,\"\",ROW())","v":10},"Photography Briefs",null,"Sustainability in Art and Design Practice",{"$f":"IF(COUNTIF(Diploma!$E$20:$E$83,I10)>=1,\"\",ROW())","v":10},"Sustainability in Art and Design Practice",null,"Drawing from Observation",{"$f":"IF(COUNTIF(Diploma!$E$20:$E$83,M10)>=1,\"\",ROW())","v":10},"Drawing from Observation",null,"Designing for Print and Screen",{"$f":"IF(COUNTIF(Diploma!$E$20:$E$83,Q10)>=1,\"\",ROW())","v":10},"Designing for Print and Screen",null,"Digital Art and Design Briefs",{"$f":"IF(COUNTIF(Diploma!$E$20:$E$83,U10)>=1,\"\",ROW())","v":10},"Digital Art and Design Briefs",null,"Ceramics",{"$f":"IF(COUNTIF(Diploma!$E$20:$E$83,Y10)>=1,\"\",ROW())","v":10},"Ceramics",null,"Moving Image Briefs",{"$f":"IF(COUNTIF(Diploma!$E$20:$E$83,AC10)>=1,\"\",ROW())","v":10},"Moving Image Briefs",null,"Financial Planning and Forecasting",{"$f":"IF(COUNTIF(Diploma!$E$20:$E$83,AG10)>=1,\"\",ROW())","v":10},"Financial Planning and Forecasting",null,"Exploring Plastering and Dry Lining Principles and Techniques",{"$f":"IF(COUNTIF(Diploma!$E$20:$E$83,AK10)>=1,\"\",ROW())","v":10},"Exploring Painting and Decorating Principles and Techniques",null,"Digital Audio Editing",{"$f":"IF(COUNTIF(Diploma!$E$20:$E$83,AO10)>=1,\"\",ROW())","v":10},"Digital Audio Editing",null,null,null,null,null,"Sustainable Vehicle Power and Structure Design",{"$f":"IF(COUNTIF(Diploma!$E$20:$E$83,AW10)>=1,\"\",ROW())","v":10},"Sustainable Vehicle Power and Structure Design",null,null,null,null,null,null,null,null,null,null,null,null,null,null,null,null,null,null,null,null,null,"Fabrication Techniques",{"$f":"IF(COUNTIF(Diploma!$E$20:$E$83,BU10)>=1,\"\",ROW())","v":10},"Fabrication Techniques",null,null,null,null,null,"Production Planning for Engineering",{"$f":"IF(COUNTIF(Diploma!$E$20:$E$83,CC10)>=1,\"\",ROW())","v":10},"Production Planning for Engineering",null,null,null,null,null,null,null,null,null,"Contemporary World Food Cooking Skills",{"$f":"IF(COUNTIF(Diploma!$E$20:$E$83,CO10)>=1,\"\",ROW())","v":10},"Contemporary World Food Cooking Skills",null,"Computer Security in Practice",{"$f":"IF(COUNTIF(Diploma!$E$20:$E$83,CS10)>=1,\"\",ROW())","v":10},"Computer Security in Practice",null,null,null,null,null,"Website Development",{"$f":"IF(COUNTIF(Diploma!$E$20:$E$83,DA10)>=1,\"\",ROW())","v":10},"Website Development",null,"Website Development",{"$f":"IF(COUNTIF(Diploma!$E$20:$E$83,DE10)>=1,\"\",ROW())","v":10},"Website Development",null,"The Development of Music",{"$f":"IF(COUNTIF(Diploma!$E$20:$E$83,DI10)>=1,\"\",ROW())","v":10},"The Development of Music",null,null,null,null,null,"Jazz Dance Techniques",{"$f":"IF(COUNTIF(Diploma!$E$20:$E$83,DQ10)>=1,\"\",ROW())","v":10},"Jazz Dance Techniques",null,"Physical Theatre Performance",{"$f":"IF(COUNTIF(Diploma!$E$20:$E$83,DU10)>=1,\"\",ROW())","v":10},"Physical Theatre Performance",null,"Lighting for Performance",{"$f":"IF(COUNTIF(Diploma!$E$20:$E$83,DY10)>=1,\"\",ROW())","v":10},"Lighting for Performance",null,"Variety Performance",{"$f":"IF(COUNTIF(Diploma!$E$20:$E$83,EC10)>=1,\"\",ROW())","v":10},"Variety Performance",null,"Sound for Performance",{"$f":"IF(COUNTIF(Diploma!$E$20:$E$83,EG10)>=1,\"\",ROW())","v":10},"Sound for Performance",null,"Supporting Performance: Front of House",{"$f":"IF(COUNTIF(Diploma!$E$20:$E$83,EK10)>=1,\"\",ROW())","v":10},"Supporting Performance: Front of House",null,"Jazz Dance Techniques",{"$f":"IF(COUNTIF(Diploma!$E$20:$E$83,EO10)>=1,\"\",ROW())","v":10},"Jazz Dance Techniques",null,"Volunteering for the Public Services",{"$f":"IF(COUNTIF(Diploma!$E$20:$E$83,ES10)>=1,\"\",ROW())","v":10},"Volunteering for the Public Services",null,null,null,null,null,"Sport Community Volunteering",{"$f":"IF(COUNTIF(Diploma!$E$20:$E$83,FA10)>=1,\"\",ROW())","v":10},"Sport Community Volunteering",null,null,null,null,null,"The Provision of Sport and Active Leisure",{"$f":"IF(COUNTIF(Diploma!$E$20:$E$83,FI10)>=1,\"\",ROW())","v":10},"The Provision of Sport and Active Leisure",null,null,null,null,null,null,null,null,null,"UK Travel Agency Operations",{"$f":"IF(COUNTIF(Diploma!$E$20:$E$83,FU10)>=1,\"\",ROW())","v":10},"UK Travel Agency Operations"]
["Designing and Making Useful Devices in Science",{"$f":"IF(COUNTIF(Diploma!$E$20:$E$83,A11)>=1,\"\",ROW())","v":11},"Designing and Making Useful Devices in Science",null,"Designing for the Future",{"$f":"IF(COUNTIF(Diploma!$E$20:$E$83,E11)>=1,\"\",ROW())","v":11},"Designing for the Future",null,"Modelmaking",{"$f":"IF(COUNTIF(Diploma!$E$20:$E$83,I11)>=1,\"\",ROW())","v":11},"Modelmaking",null,"Designing for Print and Screen",{"$f":"IF(COUNTIF(Diploma!$E$20:$E$83,M11)>=1,\"\",ROW())","v":11},"Designing for Print and Screen",null,"Editing Photographic Images",{"$f":"IF(COUNTIF(Diploma!$E$20:$E$83,Q11)>=1,\"\",ROW())","v":11},"Editing Photographic Images",null,"Interactive Media Production Briefs",{"$f":"IF(COUNTIF(Diploma!$E$20:$E$83,U11)>=1,\"\",ROW())","v":11},"Interactive Media Production Briefs",null,"Surface Design",{"$f":"IF(COUNTIF(Diploma!$E$20:$E$83,Y11)>=1,\"\",ROW())","v":11},"Surface Design",null,"Interaction Design",{"$f":"IF(COUNTIF(Diploma!$E$20:$E$83,AC11)>=1,\"\",ROW())","v":11},"Interaction Design",null,"Business Online",{"$f":"IF(COUNTIF(Diploma!$E$20:$E$83,AG11)>=1,\"\",ROW())","v":11},"Business Online",null,"Carpentry and Joinery Operations",{"$f":"IF(COUNTIF(Diploma!$E$20:$E$83,AK11)>=1,\"\",ROW())","v":11},"Exploring Plumbing Principles and Techniques",null,"Graphic Design for Digital Media",{"$f":"IF(COUNTIF(Diploma!$E$20:$E$83,AO11)>=1,\"\",ROW())","v":11},"Graphic Design for Digital Media",null,null,null,null,null,"Continuous Improvement and Problem-Solving",{"$f":"IF(COUNTIF(Diploma!$E$20:$E$83,AW11)>=1,\"\",ROW())","v":11},"Continuous Improvement and Problem-Solving",null,null,null,null,null,null,null,null,null,null,null,null,null,null,null,null,null,null,null,null,null,"Casting Techniques",{"$f":"IF(COUNTIF(Diploma!$E$20:$E$83,BU11)>=1,\"\",ROW())","v":11},"Casting Techniques",null,null,null,null,null,"Engineering Marking Out",{"$f":"IF(COUNTIF(Diploma!$E$20:$E$83,CC11)>=1,\"\",ROW())","v":11},"Engineering Marking Out",null,null,null,null,null,null,null,null,null,"Menu Planning",{"$f":"IF(COUNTIF(Diploma!$E$20:$E$83,CO11)>=1,\"\",ROW())","v":11},"Menu Planning",null,"Computer Systems Support in Practice",{"$f":"IF(COUNTIF(Diploma!$E$20:$E$83,CS11)>=1,\"\",ROW())","v":11},"Computer Systems Support in Practice",null,null,null,null,null,"Installing and Maintaining Computer Hardware",{"$f":"IF(COUNTIF(Diploma!$E$20:$E$83,DA11)>=1,\"\",ROW())","v":11},"Installing and Maintaining Computer Hardware",null,"Installing and Maintaining Computer Hardware",{"$f":"IF(COUNTIF(Diploma!$E$20:$E$83,DE11)>=1,\"\",ROW())","v":11},"Installing and Maintaining Computer Hardware",null,"Developing Music Composition",{"$f":"IF(COUNTIF(Diploma!$E$20:$E$83,DI11)>=1,\"\",ROW())","v":11},"Developing Music Composition",null,null,null,null,null,"Design Planning for Performance",{"$f":"IF(COUNTIF(Diploma!$E$20:$E$83,DQ11)>=1,\"\",ROW())","v":11},"Design Planning for Performance",null,"Variety Performance",{"$f":"IF(COUNTIF(Diploma!$E$20:$E$83,DU11)>=1,\"\",ROW())","v":11},"Variety Performance",null,"Sound for Performance",{"$f":"IF(COUNTIF(Diploma!$E$20:$E$83,DY11)>=1,\"\",ROW())","v":11},"Sound for Performance",null,"Singing Skills in the Performing Arts",{"$f":"IF(COUNTIF(Diploma!$E$20:$E$83,EC11)>=1,\"\",ROW())","v":11},"Singing Skills in the Performing Arts",null,"Make-up for Performance",{"$f":"IF(COUNTIF(Diploma!$E$20:$E$83,EG11)>=1,\"\",ROW())","v":11},"Make-up for Performance",null,"Make-up for Performance",{"$f":"IF(COUNTIF(Diploma!$E$20:$E$83,EK11)>=1,\"\",ROW())","v":11},"Make-up for Performance",null,null,null,null,null,"Multi-day Expedition Experience",{"$f":"IF(OR(COUNTIF(Diploma!$E$20:$E$83,ES11)>=1,COUNTIF(Diploma!$E$20:$E$83,ES7)>=1),\"\",ROW())","v":11},"Multi-day Expedition Experience",null,null,null,null,null,null,null,null,null,null,null,null,null,"Facility Operations for Sport and Leisure",{"$f":"IF(COUNTIF(Diploma!$E$20:$E$83,FI11)>=1,\"\",ROW())","v":11},"Facility Operations for Sport and Leisure",null,null,null,null,null,null,null,null,null,"The Cruise Industry",{"$f":"IF(COUNTIF(Diploma!$E$20:$E$83,FU11)>=1,\"\",ROW())","v":11},"The Cruise Industry"]
["Chemical Analysis and Detection",{"$f":"IF(COUNTIF(Diploma!$E$20:$E$83,A12)>=1,\"\",ROW())","v":12},"Chemical Analysis and Detection",null,"Art, Craft and Design in the Creative Industries",{"$f":"IF(COUNTIF(Diploma!$E$20:$E$83,E12)>=1,\"\",ROW())","v":12},"Art, Craft and Design in the Creative Industries",null,"Sculpture",{"$f":"IF(COUNTIF(Diploma!$E$20:$E$83,I12)>=1,\"\",ROW())","v":12},"Sculpture",null,"Fashion Retail",{"$f":"IF(COUNTIF(Diploma!$E$20:$E$83,M12)>=1,\"\",ROW())","v":12},"Fashion Retail",null,"Sustainability in Art and Design Practice",{"$f":"IF(COUNTIF(Diploma!$E$20:$E$83,Q12)>=1,\"\",ROW())","v":12},"Sustainability in Art and Design Practice",null,"Designing Products",{"$f":"IF(OR(COUNTIF(Diploma!$E$20:$E$83,U12)>=1,COUNTIF(Diploma!$E$20:$E$83,U3)>=1),\"\",ROW())","v":12},"Designing Products",null,"Sustainability in Art and Design Practice",{"$f":"IF(COUNTIF(Diploma!$E$20:$E$83,Y12)>=1,\"\",ROW())","v":12},"Sustainability in Art and Design Practice",null,"Designing for Print and Screen",{"$f":"IF(COUNTIF(Diploma!$E$20:$E$83,AC12)>=1,\"\",ROW())","v":12},"Designing for Print and Screen",null,"Public Sector Business",{"$f":"IF(COUNTIF(Diploma!$E$20:$E$83,AG12)>=1,\"\",ROW())","v":12},"Public Sector Business",null,"Brickwork and Blockwork Operations",{"$f":"IF(COUNTIF(Diploma!$E$20:$E$83,AK12)>=1,\"\",ROW())","v":12},"Exploring Electrical Principles and Techniques",null,"Writing for Digital Media",{"$f":"IF(COUNTIF(Diploma!$E$20:$E$83,AO12)>=1,\"\",ROW())","v":12},"Writing for Digital Media",null,null,null,null,null,"Electronic Devices and Communication Applications",{"$f":"IF(COUNTIF(Diploma!$E$20:$E$83,AW12)>=1,\"\",ROW())","v":12},"Electronic Devices and Communication Applications",null,null,null,null,null,null,null,null,null,null,null,null,null,null,null,null,null,null,null,null,null,"Production Planning for Engineering",{"$f":"IF(COUNTIF(Diploma!$E$20:$E$83,BU12)>=1,\"\",ROW())","v":12},"Production Planning for Engineering",null,null,null,null,null,"Application of Quality Control and Measurement in Engineering",{"$f":"IF(COUNTIF(Diploma!$E$20:$E$83,CC12)>=1,\"\",ROW())","v":12},"Application of Quality Control and Measurement in Engineering",null,null,null,null,null,null,null,null,null,"Managing Finance in Hospitality",{"$f":"IF(COUNTIF(Diploma!$E$20:$E$83,CO12)>=1,\"\",ROW())","v":12},"Managing Finance in Hospitality",null,"Software Systems Development",{"$f":"IF(COUNTIF(Diploma!$E$20:$E$83,CS12)>=1,\"\",ROW())","v":12},"Software Systems Development",null,null,null,null,null,"Installing and Maintaining Computer Software",{"$f":"IF(COUNTIF(Diploma!$E$20:$E$83,DA12)>=1,\"\",ROW())","v":12},"Installing and Maintaining Computer Software",null,"Installing and Maintaining Computer Software",{"$f":"IF(COUNTIF(Diploma!$E$20:$E$83,DE12)>=1,\"\",ROW())","v":12},"Installing and Maintaining Computer Software",null,"Producing a Music Recording",{"$f":"IF(COUNTIF(Diploma!$E$20:$E$83,DI12)>=1,\"\",ROW())","v":12},"Producing a Music Recording",null,null,null,null,null,"Realising Costume Design for Performance",{"$f":"IF(COUNTIF(Diploma!$E$20:$E$83,DQ12)>=1,\"\",ROW())","v":12},"Realising Costume Design for Performance",null,"Singing Skills in the Performing Arts",{"$f":"IF(COUNTIF(Diploma!$E$20:$E$83,DU12)>=1,\"\",ROW())","v":12},"Singing Skills in the Performing Arts",null,"Make-up for Performance",{"$f":"IF(COUNTIF(Diploma!$E$20:$E$83,DY12)>=1,\"\",ROW())","v":12},"Make-up for Performance",null,null,null,null,null,"Wardrobe for Stage Performance",{"$f":"IF(COUNTIF(Diploma!$E$20:$E$83,EG12)>=1,\"\",ROW())","v":12},"Wardrobe for Stage Performance",null,"Wardrobe for Stage Performance",{"$f":"IF(COUNTIF(Diploma!$E$20:$E$83,EK12)>=1,\"\",ROW())","v":12},"Wardrobe for Stage Performance",null,null,null,null,null,"Health and Safety in the Public Services",{"$f":"IF(COUNTIF(Diploma!$E$20:$E$83,ES12)>=1,\"\",ROW())","v":12},"Health and Safety in the Public Services",null,null,null,null,null,null,null,null,null,null,null,null,null,"Sport Community Volunteering",{"$f":"IF(COUNTIF(Diploma!$E$20:$E$83,FI12)>=1,\"\",ROW())","v":12},"Sport Community Volunteering",null,null,null,null,null,null,null,null,null,"Hospitality Operations in the Travel and Tourism Sector",{"$f":"IF(COUNTIF(Diploma!$E$20:$E$83,FU12)>=1,\"\",ROW())","v":12},"Hospitality Operations in the Travel and Tourism Sector"]
["Exploring our Universe",{"$f":"IF(COUNTIF(Diploma!$E$20:$E$83,A13)>=1,\"\",ROW())","v":13},"Exploring our Universe",null,"3D Design Briefs",{"$f":"IF(OR(COUNTIF(Diploma!$E$20:$E$83,E13)>=1,COUNTIF(Diploma!$E$20:$E$83,E3)>=1),\"\",ROW())","v":13},"3D Design Briefs",null,null,null,null,null,"Surface Design",{"$f":"IF(COUNTIF(Diploma!$E$20:$E$83,M13)>=1,\"\",ROW())","v":13},"Surface Design",null,null,null,null,null,"Design Thinking",{"$f":"IF(COUNTIF(Diploma!$E$20:$E$83,U13)>=1,\"\",ROW())","v":13},"Design Thinking",null,"Modelmaking",{"$f":"IF(COUNTIF(Diploma!$E$20:$E$83,Y13)>=1,\"\",ROW())","v":13},"Modelmaking",null,"Editing Photographic Images",{"$f":"IF(COUNTIF(Diploma!$E$20:$E$83,AC13)>=1,\"\",ROW())","v":13},"Editing Photographic Images",null,"Enhancing the Customer Experience",{"$f":"IF(COUNTIF(Diploma!$E$20:$E$83,AG13)>=1,\"\",ROW())","v":13},"Enhancing the Customer Experience",null,"Painting and Paperhanging Operations",{"$f":"IF(COUNTIF(Diploma!$E$20:$E$83,AK13)>=1,\"\",ROW())","v":13},"Exploring Roofing Principles and Techniques",null,"Digital Games Testing",{"$f":"IF(COUNTIF(Diploma!$E$20:$E$83,AO13)>=1,\"\",ROW())","v":13},"Digital Games Testing",null,null,null,null,null,"Operation and Maintenance of Mechanical Systems and Components",{"$f":"IF(COUNTIF(Diploma!$E$20:$E$83,AW13)>=1,\"\",ROW())","v":13},"Operation and Maintenance of Mechanical Systems and Components",null,null,null,null,null,null,null,null,null,null,null,null,null,null,null,null,null,null,null,null,null,"Application of Quality Control and Measurement in Engineering",{"$f":"IF(COUNTIF(Diploma!$E$20:$E$83,BU13)>=1,\"\",ROW())","v":13},"Application of Quality Control and Measurement in Engineering",null,null,null,null,null,null,null,null,null,null,null,null,null,null,null,null,null,"Alcohol Awareness in Hospitality",{"$f":"IF(COUNTIF(Diploma!$E$20:$E$83,CO13)>=1,\"\",ROW())","v":13},"Alcohol Awareness in Hospitality",null,null,null,null,null,null,null,null,null,"Automated Computer Systems",{"$f":"IF(COUNTIF(Diploma!$E$20:$E$83,DA13)>=1,\"\",ROW())","v":13},"Automated Computer Systems",null,"Automated Computer Systems",{"$f":"IF(COUNTIF(Diploma!$E$20:$E$83,DE13)>=1,\"\",ROW())","v":13},"Automated Computer Systems",null,"Music Ensemble",{"$f":"IF(COUNTIF(Diploma!$E$20:$E$83,DI13)>=1,\"\",ROW())","v":13},"Music Ensemble",null,null,null,null,null,"Realising Set Design for Performance",{"$f":"IF(COUNTIF(Diploma!$E$20:$E$83,DQ13)>=1,\"\",ROW())","v":13},"Realising Set Design for Performance",null,null,null,null,null,"Wardrobe for Stage Performance",{"$f":"IF(COUNTIF(Diploma!$E$20:$E$83,DY13)>=1,\"\",ROW())","v":13},"Wardrobe for Stage Performance",null,null,null,null,null,"Use of ICT in the Performing Arts",{"$f":"IF(COUNTIF(Diploma!$E$20:$E$83,EG13)>=1,\"\",ROW())","v":13},"Use of ICT in the Performing Arts",null,"Planning and Managing a Performing Arts Event",{"$f":"IF(COUNTIF(Diploma!$E$20:$E$83,EK13)>=1,\"\",ROW())","v":13},"Planning and Managing a Performing Arts Event",null,null,null,null,null,"Preparing to Respond to Emergency Incidents",{"$f":"IF(COUNTIF(Diploma!$E$20:$E$83,ES13)>=1,\"\",ROW())","v":13},"Preparing to Respond to Emergency Incidents",null,null,null,null,null,null,null,null,null,null,null,null,null,"Work Experience in Sport",{"$f":"IF(COUNTIF(Diploma!$E$20:$E$83,FI13)>=1,\"\",ROW())","v":13},"Work Experience in Sport",null,null,null,null,null,null,null,null,null,"UK Visitor Attractions",{"$f":"IF(COUNTIF(Diploma!$E$20:$E$83,FU13)>=1,\"\",ROW())","v":13},"UK Visitor Attractions"]
["Electronics in Action",{"$f":"IF(COUNTIF(Diploma!$E$20:$E$83,A14)>=1,\"\",ROW())","v":14},"Electronics in Action",null,"Digital Art and Design Briefs",{"$f":"IF(COUNTIF(Diploma!$E$20:$E$83,E14)>=1,\"\",ROW())","v":14},"Digital Art and Design Briefs",null,null,null,null,null,"Sustainability in Art and Design Practice",{"$f":"IF(COUNTIF(Diploma!$E$20:$E$83,M14)>=1,\"\",ROW())","v":14},"Sustainability in Art and Design Practice",null,null,null,null,null,"Moving Image Briefs",{"$f":"IF(COUNTIF(Diploma!$E$20:$E$83,U14)>=1,\"\",ROW())","v":14},"Moving Image Briefs",null,"Sculpture",{"$f":"IF(COUNTIF(Diploma!$E$20:$E$83,Y14)>=1,\"\",ROW())","v":14},"Sculpture",null,"Sustainability in Art and Design Practice",{"$f":"IF(COUNTIF(Diploma!$E$20:$E$83,AC14)>=1,\"\",ROW())","v":14},"Sustainability in Art and Design Practice",null,"Visual Merchandising in Retail Business",{"$f":"IF(COUNTIF(Diploma!$E$20:$E$83,AG14)>=1,\"\",ROW())","v":14},"Visual Merchandising in Retail Business",null,"Plumbing Operations",{"$f":"IF(COUNTIF(Diploma!$E$20:$E$83,AK14)>=1,\"\",ROW())","v":14},"Exploring Wall and Floor Tiling Principles and Techniques",null,"Digital Art for a Media Product",{"$f":"IF(COUNTIF(Diploma!$E$20:$E$83,AO14)>=1,\"\",ROW())","v":14},"Digital Art for a Media Product",null,null,null,null,null,"Operation and Maintenance of Electronic Systems and Components",{"$f":"IF(COUNTIF(Diploma!$E$20:$E$83,AW14)>=1,\"\",ROW())","v":14},"Operation and Maintenance of Electronic Systems and Components",null,null,null,null,null,null,null,null,null,null,null,null,null,null,null,null,null,null,null,null,null,null,null,null,null,null,null,null,null,null,null,null,null,null,null,null,null,null,null,null,null,"Hospitality Research Project",{"$f":"IF(COUNTIF(Diploma!$E$20:$E$83,CO14)>=1,\"\",ROW())","v":14},"Hospitality Research Project",null,null,null,null,null,null,null,null,null,"Building a Personal Computer",{"$f":"IF(COUNTIF(Diploma!$E$20:$E$83,DA14)>=1,\"\",ROW())","v":14},"Building a Personal Computer",null,"Building a Personal Computer",{"$f":"IF(COUNTIF(Diploma!$E$20:$E$83,DE14)>=1,\"\",ROW())","v":14},"Building a Personal Computer",null,"Developing Modern Music Production Skills",{"$f":"IF(COUNTIF(Diploma!$E$20:$E$83,DI14)>=1,\"\",ROW())","v":14},"Developing Modern Music Production Skills",null,null,null,null,null,"Realising Prop Design for Performance",{"$f":"IF(COUNTIF(Diploma!$E$20:$E$83,DQ14)>=1,\"\",ROW())","v":14},"Realising Prop Design for Performance",null,null,null,null,null,"Use of ICT in the Performing Arts",{"$f":"IF(COUNTIF(Diploma!$E$20:$E$83,DY14)>=1,\"\",ROW())","v":14},"Use of ICT in the Performing Arts",null,null,null,null,null,"Work Experience in the Performing Arts",{"$f":"IF(COUNTIF(Diploma!$E$20:$E$83,EG14)>=1,\"\",ROW())","v":14},"Work Experience in the Performing Arts",null,"Multimedia Production",{"$f":"IF(COUNTIF(Diploma!$E$20:$E$83,EK14)>=1,\"\",ROW())","v":14},"Multimedia Production",null,null,null,null,null,"Security Procedures in the Public Services",{"$f":"IF(COUNTIF(Diploma!$E$20:$E$83,ES14)>=1,\"\",ROW())","v":14},"Security Procedures in the Public Services",null,null,null,null,null,null,null,null,null,null,null,null,null,null,null,null,null,null,null,null,null,null,null,null,null,"Overseas Holiday Operations",{"$f":"IF(COUNTIF(Diploma!$E$20:$E$83,FU14)>=1,\"\",ROW())","v":14},"Overseas Holiday Operations"]
["Biotechnology Procedures and Applications",{"$f":"IF(COUNTIF(Diploma!$E$20:$E$83,A15)>=1,\"\",ROW())","v":15},"Biotechnology Procedures and Applications",null,"Interactive Media Production Briefs",{"$f":"IF(COUNTIF(Diploma!$E$20:$E$83,E15)>=1,\"\",ROW())","v":15},"Interactive Media Production Briefs",null,null,null,null,null,null,null,null,null,null,null,null,null,"Interaction Design",{"$f":"IF(COUNTIF(Diploma!$E$20:$E$83,U15)>=1,\"\",ROW())","v":15},{"$f":"IF(ROW(U15)-ROW(U$2)+1>COUNT(V$2:V$50),\"\",INDEX(U:U,SMALL(V$2:V$50,1+ROW(U15)-ROW(U$2))))","v":"Interaction Design"},null,null,null,null,null,"Advertising Briefs",{"$f":"IF(COUNTIF(Diploma!$E$20:$E$83,AC15)>=1,\"\",ROW())","v":15},"Advertising Briefs",null,"Delivering and Improving Customer Service",{"$f":"IF(COUNTIF(Diploma!$E$20:$E$83,AG15)>=1,\"\",ROW())","v":15},"Delivering and Improving Customer Service",null,"Electrical Operations",{"$f":"IF(COUNTIF(Diploma!$E$20:$E$83,AK15)>=1,\"\",ROW())","v":15},"Exploring Plastering and Dry Lining Principles and Techniques",null,"Digital Audio Mixing",{"$f":"IF(COUNTIF(Diploma!$E$20:$E$83,AO15)>=1,\"\",ROW())","v":15},"Digital Audio Mixing",null,null,null,null,null,"Operation and Maintenance of Electrical Systems and Components",{"$f":"IF(COUNTIF(Diploma!$E$20:$E$83,AW15)>=1,\"\",ROW())","v":15},"Operation and Maintenance of Electrical Systems and Components",null,null,null,null,null,null,null,null,null,null,null,null,null,null,null,null,null,null,null,null,null,null,null,null,null,null,null,null,null,null,null,null,null,null,null,null,null,null,null,null,null,"Work Experience in Hospitality",{"$f":"IF(OR(COUNTIF(Diploma!$E$20:$E$83,CO15)>=1,COUNTIF(Diploma!$E$20:$E$83,CO16)>=1),\"\",ROW())","v":15},"Work Experience in Hospitality",null,null,null,null,null,null,null,null,null,"A Technology Business",{"$f":"IF(COUNTIF(Diploma!$E$20:$E$83,DA15)>=1,\"\",ROW())","v":15},"A Technology Business",null,"A Technology Business",{"$f":"IF(COUNTIF(Diploma!$E$20:$E$83,DE15)>=1,\"\",ROW())","v":15},"A Technology Business",null,"Developing Music Theory",{"$f":"IF(COUNTIF(Diploma!$E$20:$E$83,DI15)>=1,\"\",ROW())","v":15},"Developing Music Theory",null,null,null,null,null,"Realising Mask Design for Performance",{"$f":"IF(COUNTIF(Diploma!$E$20:$E$83,DQ15)>=1,\"\",ROW())","v":15},"Realising Mask Design for Performance",null,null,null,null,null,"Work Experience in the Performing Arts",{"$f":"IF(COUNTIF(Diploma!$E$20:$E$83,DY15)>=1,\"\",ROW())","v":15},"Work Experience in the Performing Arts",null,null,null,null,null,null,null,null,null,"Use of ICT in the Performing Arts",{"$f":"IF(COUNTIF(Diploma!$E$20:$E$83,EK15)>=1,\"\",ROW())","v":15},"Use of ICT in the Performing Arts",null,null,null,null,null,"Law and its Impact on the Individual",{"$f":"IF(COUNTIF(Diploma!$E$20:$E$83,ES15)>=1,\"\",ROW())","v":15},"Law and its Impact on the Individual"]
["Further Chemistry",{"$f":"IF(COUNTIF(Diploma!$E$20:$E$83,A16)>=1,\"\",ROW())","v":16},"Further Chemistry",null,"Painting Briefs",{"$f":"IF(OR(COUNTIF(Diploma!$E$20:$E$83,E16)>=1,COUNTIF(Diploma!$E$20:$E$83,E2)>=1),\"\",ROW())","v":16},"Painting Briefs",null,null,null,null,null,null,null,null,null,null,null,null,null,"Ceramics",{"$f":"IF(COUNTIF(Diploma!$E$20:$E$83,U16)>=1,\"\",ROW())","v":16},{"$f":"IF(ROW(U16)-ROW(U$2)+1>COUNT(V$2:V$50),\"\",INDEX(U:U,SMALL(V$2:V$50,1+ROW(U16)-ROW(U$2))))","v":"Ceramics"},null,null,null,null,null,"Modelmaking",{"$f":"IF(COUNTIF(Diploma!$E$20:$E$83,AC16)>=1,\"\",ROW())","v":16},"Modelmaking",null,"Effective Business Communication",{"$f":"IF(COUNTIF(Diploma!$E$20:$E$83,AG16)>=1,\"\",ROW())","v":16},"Effective Business Communication",null,"Tendering and Estimating",{"$f":"IF(COUNTIF(Diploma!$E$20:$E$83,AK16)>=1,\"\",ROW())","v":16},"Carpentry and Joinery Operations",null,"Lighting for Moving Image",{"$f":"IF(COUNTIF(Diploma!$E$20:$E$83,AO16)>=1,\"\",ROW())","v":16},"Lighting for Moving Image",null,null,null,null,null,"Operation and Maintenance of Fluid Power Systems and Components",{"$f":"IF(COUNTIF(Diploma!$E$20:$E$83,AW16)>=1,\"\",ROW())","v":16},"Operation and Maintenance of Fluid Power Systems and Components",null,null,null,null,null,null,null,null,null,null,null,null,null,null,null,null,null,null,null,null,null,null,null,null,null,null,null,null,null,null,null,null,null,null,null,null,null,null,null,null,null,"Hospitality Community Volunteering",{"$f":"IF(OR(COUNTIF(Diploma!$E$20:$E$83,CO16)>=1,COUNTIF(Diploma!$E$20:$E$83,CO15)>=1),\"\",ROW())","v":16},"Hospitality Community Volunteering",null,null,null,null,null,null,null,null,null,"Computer Systems Support in Practice",{"$f":"IF(COUNTIF(Diploma!$E$20:$E$83,DA16)>=1,\"\",ROW())","v":16},"Computer Systems Support in Practice",null,"Computer Systems Support in Practice",{"$f":"IF(COUNTIF(Diploma!$E$20:$E$83,DE16)>=1,\"\",ROW())","v":16},"Computer Systems Support in Practice",null,"Music Fusion",{"$f":"IF(COUNTIF(Diploma!$E$20:$E$83,DI16)>=1,\"\",ROW())","v":16},"Music Fusion",null,null,null,null,null,"Lighting for Performance",{"$f":"IF(COUNTIF(Diploma!$E$20:$E$83,DQ16)>=1,\"\",ROW())","v":16},"Lighting for Performance",null,null,null,null,null,null,null,null,null,null,null,null,null,null,null,null,null,"Work Experience in the Performing Arts",{"$f":"IF(COUNTIF(Diploma!$E$20:$E$83,EK16)>=1,\"\",ROW())","v":16},"Work Experience in the Performing Arts"]
["Further Physics",{"$f":"IF(COUNTIF(Diploma!$E$20:$E$83,A17)>=1,\"\",ROW())","v":17},"Further Physics",null,"Designing Products",{"$f":"IF(OR(COUNTIF(Diploma!$E$20:$E$83,E17)>=1,COUNTIF(Diploma!$E$20:$E$83,E3)>=1),\"\",ROW())","v":17},"Designing Products",null,null,null,null,null,null,null,null,null,null,null,null,null,"Sustainability in Art and Design Practice",{"$f":"IF(COUNTIF(Diploma!$E$20:$E$83,U17)>=1,\"\",ROW())","v":17},{"$f":"IF(ROW(U17)-ROW(U$2)+1>COUNT(V$2:V$50),\"\",INDEX(U:U,SMALL(V$2:V$50,1+ROW(U17)-ROW(U$2))))","v":"Sustainability in Art and Design Practice"},null,null,null,null,null,null,null,null,null,"Working in Business Teams",{"$f":"IF(COUNTIF(Diploma!$E$20:$E$83,AG17)>=1,\"\",ROW())","v":17},"Working in Business Teams",null,"Exploring Surveying",{"$f":"IF(COUNTIF(Diploma!$E$20:$E$83,AK17)>=1,\"\",ROW())","v":17},"Brickwork and Blockwork Operations",null,"Advertising Production",{"$f":"IF(COUNTIF(Diploma!$E$20:$E$83,AO17)>=1,\"\",ROW())","v":17},"Advertising Production",null,null,null,null,null,"Fabrication Techniques",{"$f":"IF(COUNTIF(Diploma!$E$20:$E$83,AW17)>=1,\"\",ROW())","v":17},"Fabrication Techniques",null,null,null,null,null,null,null,null,null,null,null,null,null,null,null,null,null,null,null,null,null,null,null,null,null,null,null,null,null,null,null,null,null,null,null,null,null,null,null,null,null,"Sales and Merchandising in Hospitality",{"$f":"IF(COUNTIF(Diploma!$E$20:$E$83,CO17)>=1,\"\",ROW())","v":17},"Sales and Merchandising in Hospitality",null,null,null,null,null,null,null,null,null,"IT Work Experience",{"$f":"IF(COUNTIF(Diploma!$E$20:$E$83,DA17)>=1,\"\",ROW())","v":17},"IT Work Experience",null,"IT Work Experience",{"$f":"IF(COUNTIF(Diploma!$E$20:$E$83,DE17)>=1,\"\",ROW())","v":17},"IT Work Experience",null,"Music Arrangement",{"$f":"IF(COUNTIF(Diploma!$E$20:$E$83,DI17)>=1,\"\",ROW())","v":17},"Music Arrangement",null,null,null,null,null,"Sound for Performance",{"$f":"IF(COUNTIF(Diploma!$E$20:$E$83,DQ17)>=1,\"\",ROW())","v":17},"Sound for Performance"]
[null,null,null,null,"Design Thinking",{"$f":"IF(COUNTIF(Diploma!$E$20:$E$83,E18)>=1,\"\",ROW())","v":18},"Design Thinking",null,null,null,null,null,null,null,null,null,null,null,null,null,"Modelmaking",{"$f":"IF(COUNTIF(Diploma!$E$20:$E$83,U18)>=1,\"\",ROW())","v":18},{"$f":"IF(ROW(U18)-ROW(U$2)+1>COUNT(V$2:V$50),\"\",INDEX(U:U,SMALL(V$2:V$50,1+ROW(U18)-ROW(U$2))))","v":"Modelmaking"},null,null,null,null,null,null,null,null,null,"Planning, Forecasting and Recording Business Finances",{"$f":"IF(COUNTIF(Diploma!$E$20:$E$83,AG18)>=1,\"\",ROW())","v":18},"Planning, Forecasting and Recording Business Finances",null,"Exploring Civil Engineering",{"$f":"IF(COUNTIF(Diploma!$E$20:$E$83,AK18)>=1,\"\",ROW())","v":18},"Painting and Paperhanging Operations",null,"Factual Media Production",{"$f":"IF(COUNTIF(Diploma!$E$20:$E$83,AO18)>=1,\"\",ROW())","v":18},"Factual Media Production",null,null,null,null,null,"Casting Techniques",{"$f":"IF(COUNTIF(Diploma!$E$20:$E$83,AW18)>=1,\"\",ROW())","v":18},"Casting Techniques",null,null,null,null,null,null,null,null,null,null,null,null,null,null,null,null,null,null,null,null,null,null,null,null,null,null,null,null,null,null,null,null,null,null,null,null,null,null,null,null,null,"Barista Skills in Hospitality",{"$f":"IF(COUNTIF(Diploma!$E$20:$E$83,CO18)>=1,\"\",ROW())","v":18},"Barista Skills in Hospitality",null,null,null,null,null,null,null,null,null,null,null,null,null,null,null,null,null,"Exploring Music Improvisation",{"$f":"IF(COUNTIF(Diploma!$E$20:$E$83,DI18)>=1,\"\",ROW())","v":18},"Exploring Music Improvisation",null,null,null,null,null,"Supporting Performance: Stage Management",{"$f":"IF(COUNTIF(Diploma!$E$20:$E$83,DQ18)>=1,\"\",ROW())","v":18},"Supporting Performance: Stage Management"]
[null,null,null,null,"Fashion Promotion",{"$f":"IF(COUNTIF(Diploma!$E$20:$E$83,E19)>=1,\"\",ROW())","v":19},"Fashion Promotion",null,null,null,null,null,null,null,null,null,null,null,null,null,null,null,null,null,null,null,null,null,null,null,null,null,"Work Experience in Business",{"$f":"IF(OR(COUNTIF(Diploma!$E$20:$E$83,AG19)>=1,COUNTIF(Diploma!$E$20:$E$83,AG6)>=1),\"\",ROW())","v":19},"Work Experience in Business",null,"Exploring Building Services Engineering",{"$f":"IF(COUNTIF(Diploma!$E$20:$E$83,AK19)>=1,\"\",ROW())","v":19},"Plumbing Operations",null,null,null,null,null,null,null,null,null,"Vehicle Maintenance Techniques",{"$f":"IF(COUNTIF(Diploma!$E$20:$E$83,AW19)>=1,\"\",ROW())","v":19},"Vehicle Maintenance Techniques",null,null,null,null,null,null,null,null,null,null,null,null,null,null,null,null,null,null,null,null,null,null,null,null,null,null,null,null,null,null,null,null,null,null,null,null,null,null,null,null,null,null,null,null,null,null,null,null,null,null,null,null,null,null,null,null,null,null,null,null,null,"Exploring DJing",{"$f":"IF(COUNTIF(Diploma!$E$20:$E$83,DI19)>=1,\"\",ROW())","v":19},"Exploring DJing",null,null,null,null,null,"Supporting Performance: Front of House",{"$f":"IF(COUNTIF(Diploma!$E$20:$E$83,DQ19)>=1,\"\",ROW())","v":19},"Supporting Performance: Front of House"]
[null,null,null,null,"Moving Image Briefs",{"$f":"IF(COUNTIF(Diploma!$E$20:$E$83,E20)>=1,\"\",ROW())","v":20},"Moving Image Briefs",null,null,null,null,null,null,null,null,null,null,null,null,null,null,null,null,null,null,null,null,null,null,null,null,null,"Introducing International Business",{"$f":"IF(COUNTIF(Diploma!$E$20:$E$83,AG20)>=1,\"\",ROW())","v":20},"Introducing International Business",null,"Exploring Facilities Management",{"$f":"IF(COUNTIF(Diploma!$E$20:$E$83,AK20)>=1,\"\",ROW())","v":20},"Electrical Operations",null,null,null,null,null,null,null,null,null,"Production Planning for Engineering",{"$f":"IF(COUNTIF(Diploma!$E$20:$E$83,AW20)>=1,\"\",ROW())","v":20},"Production Planning for Engineering",null,null,null,null,null,null,null,null,null,null,null,null,null,null,null,null,null,null,null,null,null,null,null,null,null,null,null,null,null,null,null,null,null,null,null,null,null,null,null,null,null,null,null,null,null,null,null,null,null,null,null,null,null,null,null,null,null,null,null,null,null,"Music Promotion",{"$f":"IF(COUNTIF(Diploma!$E$20:$E$83,DI20)>=1,\"\",ROW())","v":20},"Music Promotion",null,null,null,null,null,"Make-up for Performance",{"$f":"IF(COUNTIF(Diploma!$E$20:$E$83,DQ20)>=1,\"\",ROW())","v":20},"Make-up for Performance"]
[null,null,null,null,"Interaction Design",{"$f":"IF(COUNTIF(Diploma!$E$20:$E$83,E21)>=1,\"\",ROW())","v":21},"Interaction Design",null,null,null,null,null,null,null,null,null,null,null,null,null,null,null,null,null,null,null,null,null,null,null,null,null,"Introducing the Economic Environment",{"$f":"IF(COUNTIF(Diploma!$E$20:$E$83,AG21)>=1,\"\",ROW())","v":21},"Introducing the Economic Environment",null,"Construction Work Experience",{"$f":"IF(COUNTIF(Diploma!$E$20:$E$83,AK21)>=1,\"\",ROW())","v":21},"Tendering and Estimating",null,null,null,null,null,null,null,null,null,"Engineering Marking Out",{"$f":"IF(COUNTIF(Diploma!$E$20:$E$83,AW21)>=1,\"\",ROW())","v":21},"Engineering Marking Out",null,null,null,null,null,null,null,null,null,null,null,null,null,null,null,null,null,null,null,null,null,null,null,null,null,null,null,null,null,null,null,null,null,null,null,null,null,null,null,null,null,null,null,null,null,null,null,null,null,null,null,null,null,null,null,null,null,null,null,null,null,"Digital and Mobile Technology for Music",{"$f":"IF(COUNTIF(Diploma!$E$20:$E$83,DI21)>=1,\"\",ROW())","v":21},"Digital and Mobile Technology for Music",null,null,null,null,null,"Wardrobe for Stage Performance",{"$f":"IF(COUNTIF(Diploma!$E$20:$E$83,DQ21)>=1,\"\",ROW())","v":21},"Wardrobe for Stage Performance"]
[null,null,null,null,"Printmaking Briefs",{"$f":"IF(COUNTIF(Diploma!$E$20:$E$83,E22)>=1,\"\",ROW())","v":22},"Printmaking Briefs",null,null,null,null,null,null,null,null,null,null,null,null,null,null,null,null,null,null,null,null,null,null,null,null,null,"Efficient Business Operations",{"$f":"IF(COUNTIF(Diploma!$E$20:$E$83,AG22)>=1,\"\",ROW())","v":22},"Efficient Business Operations",null,"Communications for Construction and the Built Environment",{"$f":"IF(COUNTIF(Diploma!$E$20:$E$83,AK22)>=1,\"\",ROW())","v":22},"Exploring Surveying",null,null,null,null,null,null,null,null,null,"Preparing and Controlling Engineering Manufacturing Operations",{"$f":"IF(COUNTIF(Diploma!$E$20:$E$83,AW22)>=1,\"\",ROW())","v":22},"Preparing and Controlling Engineering Manufacturing Operations",null,null,null,null,null,null,null,null,null,null,null,null,null,null,null,null,null,null,null,null,null,null,null,null,null,null,null,null,null,null,null,null,null,null,null,null,null,null,null,null,null,null,null,null,null,null,null,null,null,null,null,null,null,null,null,null,null,null,null,null,null,"Composing for Visual Media",{"$f":"IF(COUNTIF(Diploma!$E$20:$E$83,DI22)>=1,\"\",ROW())","v":22},"Composing for Visual Media",null,null,null,null,null,"Choreographing Dance",{"$f":"IF(COUNTIF(Diploma!$E$20:$E$83,DQ22)>=1,\"\",ROW())","v":22},"Choreographing Dance"]
[null,null,null,null,"Drawing from Observation",{"$f":"IF(COUNTIF(Diploma!$E$20:$E$83,E23)>=1,\"\",ROW())","v":23},"Drawing from Observation",null,null,null,null,null,null,null,null,null,null,null,null,null,null,null,null,null,null,null,null,null,null,null,null,null,"Principles of Procurement and Supply",{"$f":"IF(COUNTIF(Diploma!$E$20:$E$83,AG23)>=1,\"\",ROW())","v":23},"Principles of Procurement and Supply",null,null,null,null,null,null,null,null,null,null,null,null,null,"PC Software and Hardware in Engineering",{"$f":"IF(COUNTIF(Diploma!$E$20:$E$83,AW23)>=1,\"\",ROW())","v":23},"PC Software and Hardware in Engineering",null,null,null,null,null,null,null,null,null,null,null,null,null,null,null,null,null,null,null,null,null,null,null,null,null,null,null,null,null,null,null,null,null,null,null,null,null,null,null,null,null,null,null,null,null,null,null,null,null,null,null,null,null,null,null,null,null,null,null,null,null,"Enterprise and Music",{"$f":"IF(COUNTIF(Diploma!$E$20:$E$83,DI23)>=1,\"\",ROW())","v":23},"Enterprise and Music",null,null,null,null,null,"Directing Performance",{"$f":"IF(COUNTIF(Diploma!$E$20:$E$83,DQ23)>=1,\"\",ROW())","v":23},"Directing Performance"]
[null,null,null,null,"Ceramics",{"$f":"IF(COUNTIF(Diploma!$E$20:$E$83,E24)>=1,\"\",ROW())","v":24},"Ceramics",null,null,null,null,null,null,null,null,null,null,null,null,null,null,null,null,null,null,null,null,null,null,null,null,null,"Implementing Procurement and Supply in Business",{"$f":"IF(COUNTIF(Diploma!$E$20:$E$83,AG24)>=1,\"\",ROW())","v":24},"Implementing Procurement and Supply in Business",null,null,null,null,null,null,null,null,null,null,null,null,null,"Application of Quality Control and Measurement in Engineering",{"$f":"IF(COUNTIF(Diploma!$E$20:$E$83,AW24)>=1,\"\",ROW())","v":24},"Application of Quality Control and Measurement in Engineering",null,null,null,null,null,null,null,null,null,null,null,null,null,null,null,null,null,null,null,null,null,null,null,null,null,null,null,null,null,null,null,null,null,null,null,null,null,null,null,null,null,null,null,null,null,null,null,null,null,null,null,null,null,null,null,null,null,null,null,null,null,null,null,null,null,null,null,null,null,"Planning and Managing a Performing Arts Event",{"$f":"IF(COUNTIF(Diploma!$E$20:$E$83,DQ24)>=1,\"\",ROW())","v":24},"Planning and Managing a Performing Arts Event"]
[null,null,null,null,"Studio Photography",{"$f":"IF(COUNTIF(Diploma!$E$20:$E$83,E25)>=1,\"\",ROW())","v":25},"Studio Photography",null,null,null,null,null,null,null,null,null,null,null,null,null,null,null,null,null,null,null,null,null,null,null,null,null,"Corporate Social Responsibility",{"$f":"IF(COUNTIF(Diploma!$E$20:$E$83,AG25)>=1,\"\",ROW())","v":25},"Corporate Social Responsibility",null,null,null,null,null,null,null,null,null,null,null,null,null,null,null,null,null,null,null,null,null,null,null,null,null,null,null,null,null,null,null,null,null,null,null,null,null,null,null,null,null,null,null,null,null,null,null,null,null,null,null,null,null,null,null,null,null,null,null,null,null,null,null,null,null,null,null,null,null,null,null,null,null,null,null,null,null,null,null,null,null,null,null,null,null,"Multimedia Production",{"$f":"IF(COUNTIF(Diploma!$E$20:$E$83,DQ25)>=1,\"\",ROW())","v":25},"Multimedia Production"]
[null,null,null,null,"Location Photography",{"$f":"IF(COUNTIF(Diploma!$E$20:$E$83,E26)>=1,\"\",ROW())","v":26},"Location Photography",null,null,null,null,null,null,null,null,null,null,null,null,null,null,null,null,null,null,null,null,null,null,null,null,null,"Managing Personal Finances",{"$f":"IF(COUNTIF(Diploma!$E$20:$E$83,AG26)>=1,\"\",ROW())","v":26},"Managing Personal Finances",null,null,null,null,null,null,null,null,null,null,null,null,null,null,null,null,null,null,null,null,null,null,null,null,null,null,null,null,null,null,null,null,null,null,null,null,null,null,null,null,null,null,null,null,null,null,null,null,null,null,null,null,null,null,null,null,null,null,null,null,null,null,null,null,null,null,null,null,null,null,null,null,null,null,null,null,null,null,null,null,null,null,null,null,null,"Physical Theatre Performance",{"$f":"IF(COUNTIF(Diploma!$E$20:$E$83,DQ26)>=1,\"\",ROW())","v":26},"Physical Theatre Performance"]
[null,null,null,null,"Designing for Print and Screen",{"$f":"IF(COUNTIF(Diploma!$E$20:$E$83,E27)>=1,\"\",ROW())","v":27},"Designing for Print and Screen",null,null,null,null,null,null,null,null,null,null,null,null,null,null,null,null,null,null,null,null,null,null,null,null,null,"Sustainability in the Business Workplace",{"$f":"IF(COUNTIF(Diploma!$E$20:$E$83,AG27)>=1,\"\",ROW())","v":27},"Sustainability in the Business Workplace",null,null,null,null,null,null,null,null,null,null,null,null,null,null,null,null,null,null,null,null,null,null,null,null,null,null,null,null,null,null,null,null,null,null,null,null,null,null,null,null,null,null,null,null,null,null,null,null,null,null,null,null,null,null,null,null,null,null,null,null,null,null,null,null,null,null,null,null,null,null,null,null,null,null,null,null,null,null,null,null,null,null,null,null,null,"Variety Performance",{"$f":"IF(COUNTIF(Diploma!$E$20:$E$83,DQ27)>=1,\"\",ROW())","v":27},"Variety Performance"]
[null,null,null,null,"Editing Photographic Images",{"$f":"IF(COUNTIF(Diploma!$E$20:$E$83,E28)>=1,\"\",ROW())","v":28},"Editing Photographic Images",null,null,null,null,null,null,null,null,null,null,null,null,null,null,null,null,null,null,null,null,null,null,null,null,null,null,null,null,null,null,null,null,null,null,null,null,null,null,null,null,null,null,null,null,null,null,null,null,null,null,null,null,null,null,null,null,null,null,null,null,null,null,null,null,null,null,null,null,null,null,null,null,null,null,null,null,null,null,null,null,null,null,null,null,null,null,null,null,null,null,null,null,null,null,null,null,null,null,null,null,null,null,null,null,null,null,null,null,null,null,null,null,null,"Use of ICT in the Performing Arts",{"$f":"IF(COUNTIF(Diploma!$E$20:$E$83,DQ28)>=1,\"\",ROW())","v":28},"Use of ICT in the Performing Arts"]
[null,null,null,null,"Fashion Retail",{"$f":"IF(COUNTIF(Diploma!$E$20:$E$83,E29)>=1,\"\",ROW())","v":29},"Fashion Retail",null,null,null,null,null,null,null,null,null,null,null,null,null,null,null,null,null,null,null,null,null,null,null,null,null,null,null,null,null,null,null,null,null,null,null,null,null,null,null,null,null,null,null,null,null,null,null,null,null,null,null,null,null,null,null,null,null,null,null,null,null,null,null,null,null,null,null,null,null,null,null,null,null,null,null,null,null,null,null,null,null,null,null,null,null,null,null,null,null,null,null,null,null,null,null,null,null,null,null,null,null,null,null,null,null,null,null,null,null,null,null,null,null,"Work Experience in the Performing Arts",{"$f":"IF(COUNTIF(Diploma!$E$20:$E$83,DQ29)>=1,\"\",ROW())","v":29},"Work Experience in the Performing Arts"]
[null,null,null,null,"Surface Design",{"$f":"IF(COUNTIF(Diploma!$E$20:$E$83,E30)>=1,\"\",ROW())","v":30},"Surface Design",null,null,null,null,null,null,null,null,null,null,null,null,null,null,null,null,null,null,null,null,null,null,null,null,null,null,null,null,null,null,null,null,null,null,null,null,null,null,null,null,null,null,null,null,null,null,null,null,null,null,null,null,null,null,null,null,null,null,null,null,null,null,null,null,null,null,null,null,null,null,null,null,null,null,null,null,null,null,null,null,null,null,null,null,null,null,null,null,null,null,null,null,null,null,null,null,null,null,null,null,null,null,null,null,null,null,null,null,null,null,null,null,null,"Singing Skills in the Performing Arts",{"$f":"IF(COUNTIF(Diploma!$E$20:$E$83,DQ30)>=1,\"\",ROW())","v":30},"Singing Skills in the Performing Arts"]
[null,null,null,null,"Sustainability in Art and Design Practice",{"$f":"IF(COUNTIF(Diploma!$E$20:$E$83,E31)>=1,\"\",ROW())","v":31},"Sustainability in Art and Design Practice"]
[null,null,null,null,"Advertising Briefs",{"$f":"IF(COUNTIF(Diploma!$E$20:$E$83,E32)>=1,\"\",ROW())","v":32},"Advertising Briefs"]
[null,null,null,null,"Modelmaking",{"$f":"IF(COUNTIF(Diploma!$E$20:$E$83,E33)>=1,\"\",ROW())","v":33},"Modelmaking"]
[null,null,null,null,"Sculpture",{"$f":"IF(OR(COUNTIF(Diploma!$E$20:$E$83,E34)>=1,COUNTIF(Diploma!$E$20:$E$83,E3)>=1),\"\",ROW())","v":34},"Sculpture"]
[]
[]
[]
[]
[null,null,null,null,null,null,null,null,null,null,null,null,null,null,null,null,null,null,null,null,null,null,null,null,null,null,null,null,null,null,null,null,null,null,null,null,"Unit 6","Unit 16","Forbidden",null,null,null,null,null,null,null,null,null,null,null,null,null,null,null,null,null,null,null,null,null,null,null,null,null,null,null,null,null,null,null,null,null,null,null,null,null,null,null,null,null,null,null,null,null,null,null,null,null,null,null,null,null,"Unit 6",null,"Unit 13","Forbidden"]
[null,null,null,null,null,null,null,null,null,null,null,null,null,null,null,null,null,null,null,null,null,null,null,null,null,null,null,null,null,null,null,null,null,null,null,null,{"$f":"COUNTIF(Diploma!$E$20:$E$25, \"Exploring Carpentry and Joinery Principles and Techniques\")","v":0},{"$f":"COUNTIF(Diploma!$E$20:$E$25, \"Carpentry and Joinery Operations\")","v":0},{"$f":"IF(AND(AK40=0,AL40=1),1,0)","v":0},null,null,null,null,null,null,null,null,null,null,null,null,null,null,null,null,null,null,null,null,null,null,null,null,null,null,null,null,null,null,null,null,null,null,null,null,null,null,null,null,null,null,null,null,null,null,null,null,null,null,null,null,null,{"$f":"COUNTIF(Diploma!$E$20:$E$27, \"Planning, Preparing, Cooking and Finishing Food\")","v":0},null,{"$f":"COUNTIF(Diploma!$E$20:$E$27, \"Contemporary World Food Cooking Skills\")","v":0},{"$f":"IF(AND(CO40=0,CQ40=1),1,0)","v":0}]
[null,null,null,null,null,null,null,null,null,null,null,null,null,null,null,null,null,null,null,null,null,null,null,null,null,null,null,null,null,null,null,null,null,null,null,null,"Unit 7","Unit 17",null,null,null,null,null,null,null,null,null,null,null,null,null,null,null,null,null,null,null,null,null,null,null,null,null,null,null,null,null,null,null,null,null,null,null,null,null,null,null,null,null,null,null,null,null,null,null,null,null,null,null,null,null,null,"Unit 4",null,"Unit 16","Forbidden"]
[null,null,null,null,null,null,null,null,null,null,null,null,null,null,null,null,null,null,null,null,null,null,null,null,null,null,null,null,null,null,null,null,null,null,null,null,{"$f":"COUNTIF(Diploma!$E$20:$E$25, \"Exploring Brickwork and Blockwork Principles and Techniques\")","v":0},{"$f":"COUNTIF(Diploma!$E$20:$E$25, \"Brickwork and Blockwork Operations\")","v":0},{"$f":"IF(AND(AK42=0,AL42=1),1,0)","v":0},null,null,null,null,null,null,null,null,null,null,null,null,null,null,null,null,null,null,null,null,null,null,null,null,null,null,null,null,null,null,null,null,null,null,null,null,null,null,null,null,null,null,null,null,null,null,null,null,null,null,null,null,null,{"$f":"COUNTIF(Diploma!$E$20:$E$27, \"Costing and Controlling Finances in the Hospitality Industry\")","v":0},null,{"$f":"COUNTIF(Diploma!$E$20:$E$27, \"Managing Finance in Hospitality\")","v":0},{"$f":"IF(AND(CO42=0,CQ42=1),1,0)","v":0}]
[null,null,null,null,null,null,null,null,null,null,null,null,null,null,null,null,null,null,null,null,null,null,null,null,null,null,null,null,null,null,null,null,null,null,null,null,"Unit 8","Unit 18"]
[null,null,null,null,null,null,null,null,null,null,null,null,null,null,null,null,null,null,null,null,null,null,null,null,null,null,null,null,null,null,null,null,null,null,null,null,{"$f":"COUNTIF(Diploma!$E$20:$E$25, \"Exploring Painting and Decorating Principles and Techniques\")","v":0},{"$f":"COUNTIF(Diploma!$E$20:$E$25, \"Painting and Paperhanging Operations\")","v":0},{"$f":"IF(AND(AK44=0,AL44=1),1,0)","v":0}]
[null,null,null,null,null,null,null,null,null,null,null,null,null,null,null,null,null,null,null,null,null,null,null,null,null,null,null,null,null,null,null,null,null,null,null,null,"Unit 9","Unit 19"]
[null,null,null,null,null,null,null,null,null,null,null,null,null,null,null,null,null,null,null,null,null,null,null,null,null,null,null,null,null,null,null,null,null,null,null,null,{"$f":"COUNTIF(Diploma!$E$20:$E$25, \"Exploring Plumbing Principles and Techniques\")","v":0},{"$f":"COUNTIF(Diploma!$E$20:$E$25, \"Plumbing Operations\")","v":0},{"$f":"IF(AND(AK46=0,AL46=1),1,0)","v":0}]
[null,null,null,null,null,null,null,null,null,null,null,null,null,null,null,null,null,null,null,null,null,null,null,null,null,null,null,null,null,null,null,null,null,null,null,null,"Unit 10","Unit 20"]
[null,null,null,null,null,null,null,null,null,null,null,null,null,null,null,null,null,null,null,null,null,null,null,null,null,null,null,null,null,null,null,null,null,null,null,null,{"$f":"COUNTIF(Diploma!$E$20:$E$25, \"Exploring Electrical Principles and Techniques\")","v":0},{"$f":"COUNTIF(Diploma!$E$20:$E$25, \"Electrical Operations\")","v":0},{"$f":"IF(AND(AK48=0,AL48=1),1,0)","v":0}]

{"sheet":"Ext Cert Data Sheet","index":11,"n_rows":373,"n_cols":19,"rows_kept":373,"cut":false,"hidden":true,"merged":[]}
["Mandatory units",null,null,null,null,null,null,"optional Units A",null,null,null,null,null,null,"optional Units B"]
["Sector","Unit number","Unit Name","GLH","Assessment type",null,null,"Sector","Unit Number","Unit Name","GLH","Assessment type",null,null,"Sector","Unit Number","Unit Name","GLH","Assessment type"]
["Applied Science",1,"Principles of Science",30,"External",null,"Practical Scientific Project","Applied Science",9,"Practical Scientific Project",30,"Internal",null,"Performance in Context","Performing Arts",9,"Performance in Context",30,"Internal"]
["Applied Science",2,"Chemistry and our Earth",30,"Internal",null,"World Energy","Applied Science",10,"World Energy",30,"Internal",null,"Movement Skills","Performing Arts",10,"Movement Skills",30,"Internal"]
["Applied Science",3,"Energy and our Universe",30,"Internal",null,"How Scientific Theories are Formulated","Applied Science",11,"How Scientific Theories are Formulated",30,"Internal",null,"Devising Performance Work","Performing Arts",11,"Devising Performance Work",30,"Internal"]
["Applied Science",4,"Biology and our Environment",30,"Internal",null,"The Living Body","Applied Science",12,"The Living Body",30,"Internal",null,"Exploring Improvisation","Performing Arts",12,"Exploring Improvisation",30,"Internal"]
["Applied Science",5,"Applications of Chemical Substances",30,"Internal",null,"Monitoring the Environment","Applied Science",13,"Monitoring the Environment",30,"Internal",null,"Multimedia Performance","Performing Arts",13,"Multimedia Performance",30,"Internal"]
["Applied Science",6,"Applications of Physical Science",30,"Internal",null,"Growing Plants for Food","Applied Science",14,"Growing Plants for Food",30,"Internal",null,"Voice and Speech for Performers","Performing Arts",14,"Voice and Speech for Performers",30,"Internal"]
["Applied Science",7,"Health Applications of Life Science",30,"Internal",null,"Investigating a Crime Scene","Applied Science",15,"Investigating a Crime Scene",30,"Internal",null,"Performing Scripted Plays","Performing Arts",15,"Performing Scripted Plays",30,"Internal"]
["Applied Science",8,"Scientific Skills",30,"External",null,"Science in Medicine","Applied Science",16,"Science in Medicine",30,"Internal",null,"Contemporary Dance Techniques","Performing Arts",16,"Contemporary Dance Techniques",30,"Internal"]
["Art and Design",1,"Introduction to Specialist Pathways in Art and Design",30,"Internal",null,"Understanding Human Behaviour","Applied Science",17,"Understanding Human Behaviour",30,"Internal",null,"Exploring Urban Dance Styles","Performing Arts",17,"Exploring Urban Dance Styles",30,"Internal"]
["Art and Design",2,"Creative Project in Art and Design",30,"External",null,"Designing and Making Useful Devices in Science","Applied Science",18,"Designing and Making Useful Devices in Science",30,"Internal",null,"Jazz Dance Techniques","Performing Arts",18,"Jazz Dance Techniques",30,"Internal"]
["Art and Design",6,"Investigating Contextual References in Art and Design",30,"Internal",null,"Chemical Analysis and Detection","Applied Science",19,"Chemical Analysis and Detection",30,"Internal",null,"Design Planning for Performance","Performing Arts",19,"Design Planning for Performance",30,"Internal"]
["Art and Design",7,"Recording for Creative Intentions in Art and Design",30,"External",null,"Exploring our Universe","Applied Science",20,"Exploring our Universe",30,"Internal",null,"Realising Costume Design for Performance","Performing Arts",20,"Realising Costume Design for Performance",30,"Internal"]
["Art and Design Design Crafts",1,"Introduction to Specialist Pathways in Art and Design",30,"Internal",null,"Electronics in Action","Applied Science",21,"Electronics in Action",30,"Internal",null,"Realising Set Design for Performance","Performing Arts",21,"Realising Set Design for Performance",30,"Internal"]
["Art and Design Design Crafts",2,"Creative Project in Art and Design",30,"External",null,"Biotechnology Procedures and Applications","Applied Science",22,"Biotechnology Procedures and Applications",30,"Internal",null,"Realising Prop Design for Performance","Performing Arts",22,"Realising Prop Design for Performance",30,"Internal"]
["Art and Design Design Crafts",6,"Investigating Contextual References in Art and Design",30,"Internal",null,"Further Chemistry","Applied Science",23,"Further Chemistry",30,"Internal",null,"Realising Mask Design for Performance","Performing Arts",23,"Realising Mask Design for Performance",30,"Internal"]
["Art and Design Design Crafts",7,"Recording for Creative Intentions in Art and Design",30,"External",null,"Further Physics","Applied Science",24,"Further Physics",30,"Internal",null,"Lighting for Performance","Performing Arts",24,"Lighting for Performance",30,"Internal"]
["Art and Design Design Crafts",9,"Design Crafts Briefs",60,"Internal",null,"Communicating Ideas in 2D","Art and Design",3,"Communicating Ideas in 2D",30,"Internal",null,"Sound for Performance","Performing Arts",25,"Sound for Performance",30,"Internal"]
["Art and Design Design Crafts",18,"3D Design Briefs",60,"Internal",null,"Communicating Ideas in 3D","Art and Design",4,"Communicating Ideas in 3D",30,"Internal",null,"Supporting Performance: Stage Management","Performing Arts",26,"Supporting Performance: Stage Management",30,"Internal"]
["Art and Design Fashion and Textiles",1,"Introduction to Specialist Pathways in Art and Design",30,"Internal",null,"Developing an Art and Design Portfolio","Art and Design",5,"Developing an Art and Design Portfolio",30,"Internal",null,"Supporting Performance: Front of House","Performing Arts",27,"Supporting Performance: Front of House",30,"Internal"]
["Art and Design Fashion and Textiles",2,"Creative Project in Art and Design",30,"External",null,"Using Mobile Devices in Art and Design","Art and Design",8,"Using Mobile Devices in Art and Design",30,"Internal",null,"Make-up for Performance","Performing Arts",28,"Make-up for Performance",30,"Internal"]
["Art and Design Fashion and Textiles",6,"Investigating Contextual References in Art and Design",30,"Internal",null,"Design Crafts Briefs","Art and Design",9,"Design Crafts Briefs",60,"Internal",null,"Wardrobe for Stage Performance","Performing Arts",29,"Wardrobe for Stage Performance",30,"Internal"]
["Art and Design Fashion and Textiles",7,"Recording for Creative Intentions in Art and Design",30,"External",null,"Fashion Briefs","Art and Design",10,"Fashion Briefs",60,"Internal",null,"Choreographing Dance","Performing Arts",30,"Choreographing Dance",60,"Internal"]
["Art and Design Fashion and Textiles",10,"Fashion Briefs",60,"Internal",null,"Graphic Design Briefs","Art and Design",11,"Graphic Design Briefs",60,"Internal",null,"Community Arts","Performing Arts",31,"Community Arts",60,"Internal"]
["Art and Design Fashion and Textiles",12,"Textiles Briefs",60,"Internal",null,"Textiles Briefs","Art and Design",12,"Textiles Briefs",60,"Internal",null,"Directing Performance","Performing Arts",32,"Directing Performance",60,"Internal"]
["Art and Design Photography",1,"Introduction to Specialist Pathways in Art and Design",30,"Internal",null,"Visual Arts Briefs","Art and Design",13,"Visual Arts Briefs",60,"Internal",null,"Planning and Managing a Performing Arts Event","Performing Arts",33,"Planning and Managing a Performing Arts Event",60,"Internal"]
["Art and Design Photography",2,"Creative Project in Art and Design",30,"External",null,"Photography Briefs","Art and Design",14,"Photography Briefs",60,"Internal",null,"Multimedia Production","Performing Arts",34,"Multimedia Production",60,"Internal"]
["Art and Design Photography",6,"Investigating Contextual References in Art and Design",30,"Internal",null,"Designing for the Future","Art and Design",15,"Designing for the Future",60,"Internal",null,"Physical Theatre Performance","Performing Arts",35,"Physical Theatre Performance",60,"Internal"]
["Art and Design Photography",7,"Recording for Creative Intentions in Art and Design",30,"External",null,"Applying Contextual References in Art and Design","Art and Design",16,"Applying Contextual References in Art and Design",30,"Internal",null,"Variety Performance","Performing Arts",36,"Variety Performance",60,"Internal"]
["Art and Design Photography",14,"Photography Briefs",60,"Internal",null,"Art, Craft and Design in the Creative Industries","Art and Design",17,"Art, Craft and Design in the Creative Industries",30,"Internal",null,"Performing Arts Enterprise","Performing Arts",37,"Performing Arts Enterprise",60,"Internal"]
["Art and Design Photography",19,"Digital Art and Design Briefs",60,"Internal",null,"3D Design Briefs","Art and Design",18,"3D Design Briefs",60,"Internal",null,"Use of ICT in the Performing Arts","Performing Arts",38,"Use of ICT in the Performing Arts",30,"Internal"]
["Art and Design Product Design",1,"Introduction to Specialist Pathways in Art and Design",30,"Internal",null,"Digital Art and Design Briefs","Art and Design",19,"Digital Art and Design Briefs",60,"Internal",null,"Work Experience in the Performing Arts","Performing Arts",39,"Work Experience in the Performing Arts",30,"Internal"]
["Art and Design Product Design",2,"Creative Project in Art and Design",30,"External",null,"Interactive Media Production Briefs","Art and Design",20,"Interactive Media Production Briefs",60,"Internal",null,"Singing Skills in the Performing Arts","Performing Arts",40,"Singing Skills in the Performing Arts",60,"Internal"]
["Art and Design Product Design",6,"Investigating Contextual References in Art and Design",30,"Internal",null,"Painting Briefs","Art and Design",21,"Painting Briefs",60,"Internal",null,"Contemporary Dance Techniques","Performing Arts Acting",16,"Contemporary Dance Techniques",30,"Internal"]
["Art and Design Product Design",7,"Recording for Creative Intentions in Art and Design",30,"External",null,"Designing Products","Art and Design",22,"Designing Products",60,"Internal",null,"Exploring Urban Dance Styles","Performing Arts Acting",17,"Exploring Urban Dance Styles",30,"Internal"]
["Art and Design Product Design",15,"Designing for the Future",60,"Internal",null,"Practical Research Project in Art and Design","Art and Design",23,"Practical Research Project in Art and Design",60,"Internal",null,"Jazz Dance Techniques","Performing Arts Acting",18,"Jazz Dance Techniques",30,"Internal"]
["Art and Design Product Design",22,"Designing Products",60,"Internal",null,"Design Thinking","Art and Design",24,"Design Thinking",60,"Internal",null,"Design Planning for Performance","Performing Arts Acting",19,"Design Planning for Performance",30,"Internal"]
["Art and Design Visual Arts",1,"Introduction to Specialist Pathways in Art and Design",30,"Internal",null,"Fashion Promotion","Art and Design",25,"Fashion Promotion",60,"Internal",null,"Realising Costume Design for Performance","Performing Arts Acting",20,"Realising Costume Design for Performance",30,"Internal"]
["Art and Design Visual Arts",2,"Creative Project in Art and Design",30,"External",null,"Moving Image Briefs","Art and Design",26,"Moving Image Briefs",60,"Internal",null,"Realising Set Design for Performance","Performing Arts Acting",21,"Realising Set Design for Performance",30,"Internal"]
["Art and Design Visual Arts",6,"Investigating Contextual References in Art and Design",30,"Internal",null,"Interaction Design","Art and Design",27,"Interaction Design",60,"Internal",null,"Realising Prop Design for Performance","Performing Arts Acting",22,"Realising Prop Design for Performance",30,"Internal"]
["Art and Design Visual Arts",7,"Recording for Creative Intentions in Art and Design",30,"External",null,"Printmaking Briefs","Art and Design",28,"Printmaking Briefs",60,"Internal",null,"Realising Mask Design for Performance","Performing Arts Acting",23,"Realising Mask Design for Performance",30,"Internal"]
["Art and Design Visual Arts",13,"Visual Arts Briefs",60,"Internal",null,"Drawing from Observation","Art and Design",29,"Drawing from Observation",60,"Internal",null,"Lighting for Performance","Performing Arts Acting",24,"Lighting for Performance",30,"Internal"]
["Art and Design Visual Arts",21,"Painting Briefs",60,"Internal",null,"Ceramics","Art and Design",30,"Ceramics",60,"Internal",null,"Sound for Performance","Performing Arts Acting",25,"Sound for Performance",30,"Internal"]
["Art and Design Visual Communication",1,"Introduction to Specialist Pathways in Art and Design",30,"Internal",null,"Studio Photography","Art and Design",31,"Studio Photography",60,"Internal",null,"Make-up for Performance","Performing Arts Acting",28,"Make-up for Performance",30,"Internal"]
["Art and Design Visual Communication",2,"Creative Project in Art and Design",30,"External",null,"Location Photography","Art and Design",32,"Location Photography",60,"Internal",null,"Wardrobe for Stage Performance","Performing Arts Acting",29,"Wardrobe for Stage Performance",30,"Internal"]
["Art and Design Visual Communication",6,"Investigating Contextual References in Art and Design",30,"Internal",null,"Designing for Print and Screen","Art and Design",33,"Designing for Print and Screen",60,"Internal",null,"Use of ICT in the Performing Arts","Performing Arts Acting",38,"Use of ICT in the Performing Arts",30,"Internal"]
["Art and Design Visual Communication",7,"Recording for Creative Intentions in Art and Design",30,"External",null,"Editing Photographic Images","Art and Design",34,"Editing Photographic Images",60,"Internal",null,"Work Experience in the Performing Arts","Performing Arts Acting",39,"Work Experience in the Performing Arts",30,"Internal"]
["Art and Design Visual Communication",11,"Graphic Design Briefs",60,"Internal",null,"Fashion Retail","Art and Design",35,"Fashion Retail",60,"Internal",null,"Voice and Speech for Performers","Performing Arts Dance",14,"Voice and Speech for Performers",30,"Internal"]
["Art and Design Visual Communication",20,"Interactive Media Production Briefs",60,"Internal",null,"Surface Design","Art and Design",36,"Surface Design",60,"Internal",null,"Performing Scripted Plays","Performing Arts Dance",15,"Performing Scripted Plays",30,"Internal"]
["Business",1,"Enterprise in the Business World",30,"Internal",null,"Sustainability in Art and Design Practice","Art and Design",37,"Sustainability in Art and Design Practice",30,"Internal",null,"Design Planning for Performance","Performing Arts Dance",19,"Design Planning for Performance",30,"Internal"]
["Business",2,"Finance for Business",30,"External",null,"Advertising Briefs","Art and Design",38,"Advertising Briefs",60,"Internal",null,"Realising Costume Design for Performance","Performing Arts Dance",20,"Realising Costume Design for Performance",30,"Internal"]
["Business",9,"Principles of Marketing",30,"External",null,"Modelmaking","Art and Design",39,"Modelmaking",60,"Internal",null,"Realising Set Design for Performance","Performing Arts Dance",21,"Realising Set Design for Performance",30,"Internal"]
["Construction and the Built Environment",1,"Construction Technology",30,"External",null,"Sculpture","Art and Design",40,"Sculpture",60,"Internal",null,"Realising Prop Design for Performance","Performing Arts Dance",22,"Realising Prop Design for Performance",30,"Internal"]
["Construction and the Built Environment",2,"Construction and Design",30,"Internal",null,"Communicating Ideas in 2D","Art and Design Design Crafts",3,"Communicating Ideas in 2D",30,"Internal",null,"Realising Mask Design for Performance","Performing Arts Dance",23,"Realising Mask Design for Performance",30,"Internal"]
["Construction and the Built Environment",3,"Scientific and Mathematical Applications for Construction",30,"Internal",null,"Developing an Art and Design Portfolio","Art and Design Design Crafts",5,"Developing an Art and Design Portfolio",30,"Internal",null,"Lighting for Performance","Performing Arts Dance",24,"Lighting for Performance",30,"Internal"]
["Construction and the Built Environment",11,"Sustainability in Construction",30,"External",null,"Fashion Briefs","Art and Design Design Crafts",10,"Fashion Briefs",60,"Internal",null,"Sound for Performance","Performing Arts Dance",25,"Sound for Performance",30,"Internal"]
["Engineering",1,"The Engineered World",30,"External",null,"Textiles Briefs","Art and Design Design Crafts",12,"Textiles Briefs",60,"Internal",null,"Make-up for Performance","Performing Arts Dance",28,"Make-up for Performance",30,"Internal"]
["Engineering",2,"Investigating an Engineered Product",30,"Internal",null,"Designing for the Future","Art and Design Design Crafts",15,"Designing for the Future",60,"Internal",null,"Wardrobe for Stage Performance","Performing Arts Dance",29,"Wardrobe for Stage Performance",30,"Internal"]
["Engineering",9,"Interpreting and Using Engineering Information",30,"External",null,"Applying Contextual References in Art and Design","Art and Design Design Crafts",16,"Applying Contextual References in Art and Design",30,"Internal",null,"Use of ICT in the Performing Arts","Performing Arts Dance",38,"Use of ICT in the Performing Arts",30,"Internal"]
["Engineering",10,"Mathematics for Engineering",30,"Internal",null,"Art, Craft and Design in the Creative Industries","Art and Design Design Crafts",17,"Art, Craft and Design in the Creative Industries",30,"Internal",null,"Work Experience in the Performing Arts","Performing Arts Dance",39,"Work Experience in the Performing Arts",30,"Internal"]
["Health and Social Care",1,"Human Lifespan Development",30,"External",null,"Painting Briefs","Art and Design Design Crafts",21,"Painting Briefs",60,"Internal",null,"Movement Skills","Performing Arts Production",10,"Movement Skills",30,"Internal"]
["Health and Social Care",2,"Health and Social Care Values",30,"Internal",null,"Communicating Ideas in 2D","Art and Design Fashion and Textiles",3,"Communicating Ideas in 2D",30,"Internal",null,"Devising Performance Work","Performing Arts Production",11,"Devising Performance Work",30,"Internal"]
["Health and Social Care",3,"Effective Communication in Health and Social Care",30,"Internal",null,"Developing an Art and Design Portfolio","Art and Design Fashion and Textiles",5,"Developing an Art and Design Portfolio",30,"Internal",null,"Exploring Improvisation","Performing Arts Production",12,"Exploring Improvisation",30,"Internal"]
["Health and Social Care",9,"Healthy Living",30,"External",null,"Design Crafts Briefs","Art and Design Fashion and Textiles",9,"Design Crafts Briefs",60,"Internal",null,"Multimedia Performance","Performing Arts Production",13,"Multimedia Performance",30,"Internal"]
["Hospitality",1,"Introducing the Hospitality Industry",30,"External",null,"Photography Briefs","Art and Design Fashion and Textiles",14,"Photography Briefs",60,"Internal",null,"Voice and Speech for Performers","Performing Arts Production",14,"Voice and Speech for Performers",30,"Internal"]
["Hospitality",2,"Working in the Hospitality Industry",30,"Internal",null,"Designing for the Future","Art and Design Fashion and Textiles",15,"Designing for the Future",60,"Internal",null,"Performing Scripted Plays","Performing Arts Production",15,"Performing Scripted Plays",30,"Internal"]
["Hospitality",3,"Food Safety and Health and Safety in Hospitality",30,"Internal",null,"Applying Contextual References in Art and Design","Art and Design Fashion and Textiles",16,"Applying Contextual References in Art and Design",30,"Internal",null,"Contemporary Dance Techniques","Performing Arts Production",16,"Contemporary Dance Techniques",30,"Internal"]
["Hospitality",9,"How the Hospitality Industry Contributes to Healthy Lifestyles",30,"External",null,"Art, Craft and Design in the Creative Industries","Art and Design Fashion and Textiles",17,"Art, Craft and Design in the Creative Industries",30,"Internal",null,"Exploring Urban Dance Styles","Performing Arts Production",17,"Exploring Urban Dance Styles",30,"Internal"]
["Hospitality",14,"Teamwork in Hospitality",60,"Internal",null,"Designing Products","Art and Design Fashion and Textiles",22,"Designing Products",60,"Internal",null,"Jazz Dance Techniques","Performing Arts Production",18,"Jazz Dance Techniques",30,"Internal"]
["Information and Creative Technology",1,"The Online World",30,"External",null,"Fashion Promotion","Art and Design Fashion and Textiles",25,"Fashion Promotion",60,"Internal",null,"Digital Editing for Moving Image","Creative Digital Media Production",9,"Digital Editing for Moving Image",60,"Internal"]
["Information and Creative Technology",2,"Technology Systems",30,"External",null,"Fashion Retail","Art and Design Fashion and Textiles",35,"Fashion Retail",60,"Internal",null,"Digital Photography for a Media Product","Creative Digital Media Production",10,"Digital Photography for a Media Product",60,"Internal"]
["Information and Creative Technology",3,"A Digital Portfolio",30,"Internal",null,"Surface Design","Art and Design Fashion and Textiles",36,"Surface Design",60,"Internal",null,"Animation for Digital Media","Creative Digital Media Production",11,"Animation for Digital Media",60,"Internal"]
["Music",1,"The Music Industry",30,"External",null,"Sustainability in Art and Design Practice","Art and Design Photography",37,"Sustainability in Art and Design Practice",30,"Internal",null,"Digital Audio Editing","Creative Digital Media Production",12,"Digital Audio Editing",30,"Internal"]
["Music",2,"Managing a Music Product",30,"Internal",null,"Communicating Ideas in 2D","Art and Design Photography",3,"Communicating Ideas in 2D",30,"Internal",null,"Graphic Design for Digital Media","Creative Digital Media Production",13,"Graphic Design for Digital Media",30,"Internal"]
["Music",8,"Music and Production Analysis",30,"External",null,"Communicating Ideas in 3D","Art and Design Photography",4,"Communicating Ideas in 3D",30,"Internal",null,"Writing for Digital Media","Creative Digital Media Production",14,"Writing for Digital Media",30,"Internal"]
["Music",16,"Music Showcase",30,"Internal",null,"Developing an Art and Design Portfolio","Art and Design Photography",5,"Developing an Art and Design Portfolio",30,"Internal",null,"Digital Games Testing","Creative Digital Media Production",15,"Digital Games Testing",30,"Internal"]
["Music",17,"Researching a Music Topic",60,"Internal",null,"Using Mobile Devices in Art and Design","Art and Design Photography",8,"Using Mobile Devices in Art and Design",30,"Internal",null,"Digital Art for a Media Product","Creative Digital Media Production",16,"Digital Art for a Media Product",30,"Internal"]
["Performing Arts",1,"Individual Showcase",30,"External",null,"Fashion Briefs","Art and Design Photography",10,"Fashion Briefs",60,"Internal",null,"Digital Audio Mixing","Creative Digital Media Production",17,"Digital Audio Mixing",30,"Internal"]
["Performing Arts",2,"Preparation, Performance and Production",30,"Internal",null,"Designing for the Future","Art and Design Photography",15,"Designing for the Future",60,"Internal",null,"Lighting for Moving Image","Creative Digital Media Production",18,"Lighting for Moving Image",30,"Internal"]
["Performing Arts",8,"The Performing Arts Industry",30,"External",null,"Applying Contextual References in Art and Design","Art and Design Photography",16,"Applying Contextual References in Art and Design",30,"Internal"]
["Performing Arts Acting",1,"Individual Showcase",30,"External",null,"Art, Craft and Design in the Creative Industries","Art and Design Photography",17,"Art, Craft and Design in the Creative Industries",30,"Internal"]
["Performing Arts Acting",2,"Preparation, Performance and Production",30,"Internal",null,"Interactive Media Production Briefs","Art and Design Photography",20,"Interactive Media Production Briefs",60,"Internal"]
["Performing Arts Acting",3,"Acting Skills",60,"Internal",null,"Designing Products","Art and Design Photography",22,"Designing Products",60,"Internal"]
["Performing Arts Acting",8,"The Performing Arts Industry",30,"External",null,"Studio Photography","Art and Design Photography",31,"Studio Photography",60,"Internal"]
["Performing Arts Dance",1,"Individual Showcase",30,"External",null,"Location Photography","Art and Design Photography",32,"Location Photography",60,"Internal"]
["Performing Arts Dance",2,"Preparation, Performance and Production",30,"Internal",null,"Editing Photographic Images","Art and Design Photography",34,"Editing Photographic Images",60,"Internal"]
["Performing Arts Dance",4,"Dance Skills",60,"Internal",null,"Communicating Ideas in 2D","Art and Design Product Design",3,"Communicating Ideas in 2D",30,"Internal"]
["Performing Arts Dance",8,"The Performing Arts Industry",30,"External",null,"Communicating Ideas in 3D","Art and Design Product Design",4,"Communicating Ideas in 3D",30,"Internal"]
["Performing Arts Production",1,"Individual Showcase",30,"External",null,"Developing an Art and Design Portfolio","Art and Design Product Design",5,"Developing an Art and Design Portfolio",30,"Internal"]
["Performing Arts Production",2,"Preparation, Performance and Production",30,"Internal",null,"Using Mobile Devices in Art and Design","Art and Design Product Design",8,"Using Mobile Devices in Art and Design",30,"Internal"]
["Performing Arts Production",7,"Production Skills for Performance",60,"Internal",null,"Fashion Briefs","Art and Design Product Design",10,"Fashion Briefs",60,"Internal"]
["Performing Arts Production",8,"The Performing Arts Industry",30,"External",null,"Graphic Design Briefs","Art and Design Product Design",11,"Graphic Design Briefs",60,"Internal"]
["Public Services",1,"The Role and Work of the Public Services",30,"External",null,"Textiles Briefs","Art and Design Product Design",12,"Textiles Briefs",60,"Internal"]
["Public Services",2,"Working Skills in the Public Services Sector",30,"Internal",null,"Applying Contextual References in Art and Design","Art and Design Product Design",16,"Applying Contextual References in Art and Design",30,"Internal"]
["Public Services",6,"Citizenship, Society and the Public Services",30,"External",null,"Art, Craft and Design in the Creative Industries","Art and Design Product Design",17,"Art, Craft and Design in the Creative Industries",30,"Internal"]
["Public Services",7,"Crime and its Effects on Society and Individuals",60,"Internal",null,"Digital Art and Design Briefs","Art and Design Product Design",19,"Digital Art and Design Briefs",60,"Internal"]
["Sport",1,"Fitness for Sport and Exercise",30,"External",null,"Interactive Media Production Briefs","Art and Design Product Design",20,"Interactive Media Production Briefs",60,"Internal"]
["Sport",2,"Practical Sports Performance",30,"Internal",null,"Developing an Art and Design Portfolio","Art and Design Visual Arts",5,"Developing an Art and Design Portfolio",30,"Internal"]
["Sport",7,"Anatomy and Physiology for Sports Performance",30,"External",null,"Using Mobile Devices in Art and Design","Art and Design Visual Arts",8,"Using Mobile Devices in Art and Design",30,"Internal"]
["Travel and Tourism",1,"The UK Travel and Tourism Sector",30,"External",null,"Design Crafts Briefs","Art and Design Visual Arts",9,"Design Crafts Briefs",60,"Internal"]
["Travel and Tourism",2,"UK Travel and Tourism Destinations",30,"Internal",null,"Fashion Briefs","Art and Design Visual Arts",10,"Fashion Briefs",60,"Internal"]
["Travel and Tourism",4,"International Travel and Tourism Destinations",30,"Internal",null,"Graphic Design Briefs","Art and Design Visual Arts",11,"Graphic Design Briefs",60,"Internal"]
["Travel and Tourism",7,"Travel and Tourism Business Environments",30,"External",null,"Textiles Briefs","Art and Design Visual Arts",12,"Textiles Briefs",60,"Internal"]
["Creative Digital Media Production",1,"Digital Media Sectors and Audiences",30,"External",null,"Photography Briefs","Art and Design Visual Arts",14,"Photography Briefs",60,"Internal"]
["Creative Digital Media Production",2,"Planning and Pitching a Digital Media Product",30,"Internal",null,"Applying Contextual References in Art and Design","Art and Design Visual Arts",16,"Applying Contextual References in Art and Design",30,"Internal"]
["Creative Digital Media Production",8,"Media Industry in Context",30,"External",null,"Art, Craft and Design in the Creative Industries","Art and Design Visual Arts",17,"Art, Craft and Design in the Creative Industries",30,"Internal"]
[null,null,null,null,null,null,"Interactive Media Production Briefs","Art and Design Visual Arts",20,"Interactive Media Production Briefs",60,"Internal"]
[null,null,null,null,null,null,"Printmaking Briefs","Art and Design Visual Arts",28,"Printmaking Briefs",60,"Internal"]
[null,null,null,null,null,null,"Drawing from Observation","Art and Design Visual Arts",29,"Drawing from Observation",60,"Internal"]
[null,null,null,null,null,null,"Surface Design","Art and Design Visual Arts",36,"Surface Design",60,"Internal"]
[null,null,null,null,null,null,"Sculpture","Art and Design Visual Arts",40,"Sculpture",60,"Internal"]
[null,null,null,null,null,null,"Communicating Ideas in 3D","Art and Design Visual Communication",4,"Communicating Ideas in 3D",30,"Internal"]
[null,null,null,null,null,null,"Developing an Art and Design Portfolio","Art and Design Visual Communication",5,"Developing an Art and Design Portfolio",30,"Internal"]
[null,null,null,null,null,null,"Using Mobile Devices in Art and Design","Art and Design Visual Communication",8,"Using Mobile Devices in Art and Design",30,"Internal"]
[null,null,null,null,null,null,"Fashion Briefs","Art and Design Visual Communication",10,"Fashion Briefs",60,"Internal"]
[null,null,null,null,null,null,"Visual Arts Briefs","Art and Design Visual Communication",13,"Visual Arts Briefs",60,"Internal"]
[null,null,null,null,null,null,"Photography Briefs","Art and Design Visual Communication",14,"Photography Briefs",60,"Internal"]
[null,null,null,null,null,null,"Designing for the Future","Art and Design Visual Communication",15,"Designing for the Future",60,"Internal"]
[null,null,null,null,null,null,"Applying Contextual References in Art and Design","Art and Design Visual Communication",16,"Applying Contextual References in Art and Design",30,"Internal"]
[null,null,null,null,null,null,"Art, Craft and Design in the Creative Industries","Art and Design Visual Communication",17,"Art, Craft and Design in the Creative Industries",30,"Internal"]
[null,null,null,null,null,null,"Digital Art and Design Briefs","Art and Design Visual Communication",19,"Digital Art and Design Briefs",60,"Internal"]
[null,null,null,null,null,null,"Painting Briefs","Art and Design Visual Communication",21,"Painting Briefs",60,"Internal"]
[null,null,null,null,null,null,"Practical Research Project in Art and Design","Art and Design Visual Communication",23,"Practical Research Project in Art and Design",60,"Internal"]
[null,null,null,null,null,null,"Moving Image Briefs","Art and Design Visual Communication",26,"Moving Image Briefs",60,"Internal"]
[null,null,null,null,null,null,"Printmaking Briefs","Art and Design Visual Communication",28,"Printmaking Briefs",60,"Internal"]
[null,null,null,null,null,null,"Drawing from Observation","Art and Design Visual Communication",29,"Drawing from Observation",60,"Internal"]
[null,null,null,null,null,null,"Ceramics","Art and Design Visual Communication",30,"Ceramics",60,"Internal"]
[null,null,null,null,null,null,"Sustainability in Art and Design Practice","Art and Design Visual Communication",37,"Sustainability in Art and Design Practice",30,"Internal"]
[null,null,null,null,null,null,"Modelmaking","Art and Design Visual Communication",39,"Modelmaking",60,"Internal"]
[null,null,null,null,null,null,"Sculpture","Art and Design Visual Communication",40,"Sculpture",60,"Internal"]
[null,null,null,null,null,null,"Promoting a Brand","Business",3,"Promoting a Brand",30,"Internal"]
[null,null,null,null,null,null,"Principles of Customer Services","Business",4,"Principles of Customer Services",30,"Internal"]
[null,null,null,null,null,null,"Sales and Personal Selling","Business",5,"Sales and Personal Selling",30,"Internal"]
[null,null,null,null,null,null,"Introducing Retail Business","Business",6,"Introducing Retail Business",30,"Internal"]
[null,null,null,null,null,null,"Providing Business Support","Business",7,"Providing Business Support",30,"Internal"]
[null,null,null,null,null,null,"Recruitment, Selection and Employment","Business",8,"Recruitment, Selection and Employment",30,"Internal"]
[null,null,null,null,null,null,"Using Business Documentation","Business",10,"Using Business Documentation",30,"Internal"]
[null,null,null,null,null,null,"Building Successful Business Teams","Business",11,"Building Successful Business Teams",30,"Internal"]
[null,null,null,null,null,null,"Introducing Law and Consumer Rights","Business",12,"Introducing Law and Consumer Rights",30,"Internal"]
[null,null,null,null,null,null,"Financial Planning and Forecasting","Business",13,"Financial Planning and Forecasting",30,"Internal"]
[null,null,null,null,null,null,"Business Online","Business",14,"Business Online",60,"Internal"]
[null,null,null,null,null,null,"Public Sector Business","Business",15,"Public Sector Business",30,"Internal"]
[null,null,null,null,null,null,"Enhancing the Customer Experience","Business",16,"Enhancing the Customer Experience",30,"Internal"]
[null,null,null,null,null,null,"Visual Merchandising in Retail Business","Business",17,"Visual Merchandising in Retail Business",30,"Internal"]
[null,null,null,null,null,null,"Small Business Planning","Business",18,"Small Business Planning",60,"Internal"]
[null,null,null,null,null,null,"Introducing Project Management","Business",19,"Introducing Project Management",60,"Internal"]
[null,null,null,null,null,null,"Delivering and Improving Customer Service","Business",20,"Delivering and Improving Customer Service",60,"Internal"]
[null,null,null,null,null,null,"Effective Business Communication","Business",21,"Effective Business Communication",60,"Internal"]
[null,null,null,null,null,null,"Working in Business Teams","Business",22,"Working in Business Teams",60,"Internal"]
[null,null,null,null,null,null,"Planning, Forecasting and Recording Business Finances","Business",23,"Planning, Forecasting and Recording Business Finances",60,"Internal"]
[null,null,null,null,null,null,"Work Experience in Business","Business",24,"Work Experience in Business",60,"Internal"]
[null,null,null,null,null,null,"Introducing International Business","Business",25,"Introducing International Business",60,"Internal"]
[null,null,null,null,null,null,"Introducing the Economic Environment","Business",26,"Introducing the Economic Environment",60,"Internal"]
[null,null,null,null,null,null,"Efficient Business Operations","Business",27,"Efficient Business Operations",60,"Internal"]
[null,null,null,null,null,null,"Principles of Procurement and Supply","Business",28,"Principles of Procurement and Supply",60,"Internal"]
[null,null,null,null,null,null,"Implementing Procurement and Supply in Business","Business",29,"Implementing Procurement and Supply in Business",60,"Internal"]
[null,null,null,null,null,null,"Corporate Social Responsibility","Business",30,"Corporate Social Responsibility",30,"Internal"]
[null,null,null,null,null,null,"Managing Personal Finances","Business",31,"Managing Personal Finances",30,"Internal"]
[null,null,null,null,null,null,"Sustainability in the Business Workplace","Business",32,"Sustainability in the Business Workplace",30,"Internal"]
[null,null,null,null,null,null,"Construction Processes and Operations","Construction and the Built Environment",4,"Construction Processes and Operations",30,"Internal"]
[null,null,null,null,null,null,"Construction Drawing Techniques","Construction and the Built Environment",5,"Construction Drawing Techniques",30,"Internal"]
[null,null,null,null,null,null,"Exploring Carpentry and Joinery Principles and Techniques","Construction and the Built Environment",6,"Exploring Carpentry and Joinery Principles and Techniques",30,"Internal"]
[null,null,null,null,null,null,"Exploring Brickwork and Blockwork Principles and Techniques","Construction and the Built Environment",7,"Exploring Brickwork and Blockwork Principles and Techniques",30,"Internal"]
[null,null,null,null,null,null,"Exploring Painting and Decorating Principles and Techniques","Construction and the Built Environment",8,"Exploring Painting and Decorating Principles and Techniques",30,"Internal"]
[null,null,null,null,null,null,"Exploring Plumbing Principles and Techniques","Construction and the Built Environment",9,"Exploring Plumbing Principles and Techniques",30,"Internal"]
[null,null,null,null,null,null,"Exploring Electrical Principles and Techniques","Construction and the Built Environment",10,"Exploring Electrical Principles and Techniques",30,"Internal"]
[null,null,null,null,null,null,"Sustainability in Construction","Construction and the Built Environment",12,"Sustainability in Construction",30,"Internal"]
[null,null,null,null,null,null,"Exploring Roofing Principles and Techniques","Construction and the Built Environment",13,"Exploring Roofing Principles and Techniques",30,"Internal"]
[null,null,null,null,null,null,"Exploring Wall and Floor Tiling Principles and Techniques","Construction and the Built Environment",14,"Exploring Wall and Floor Tiling Principles and Techniques",30,"Internal"]
[null,null,null,null,null,null,"Exploring Plastering and Dry Lining Principles and Techniques","Construction and the Built Environment",15,"Exploring Plastering and Dry Lining Principles and Techniques",30,"Internal"]
[null,null,null,null,null,null,"Carpentry and Joinery Operations","Construction and the Built Environment",16,"Carpentry and Joinery Operations",60,"Internal"]
[null,null,null,null,null,null,"Brickwork and Blockwork Operations","Construction and the Built Environment",17,"Brickwork and Blockwork Operations",60,"Internal"]
[null,null,null,null,null,null,"Painting and Paperhanging Operations","Construction and the Built Environment",18,"Painting and Paperhanging Operations",60,"Internal"]
[null,null,null,null,null,null,"Plumbing Operations","Construction and the Built Environment",19,"Plumbing Operations",30,"Internal"]
[null,null,null,null,null,null,"Electrical Operations","Construction and the Built Environment",20,"Electrical Operations",30,"Internal"]
[null,null,null,null,null,null,"Tendering and Estimating","Construction and the Built Environment",22,"Tendering and Estimating",60,"Internal"]
[null,null,null,null,null,null,"Exploring Surveying","Construction and the Built Environment",23,"Exploring Surveying",60,"Internal"]
[null,null,null,null,null,null,"Exploring Civil Engineering","Construction and the Built Environment",24,"Exploring Civil Engineering",60,"Internal"]
[null,null,null,null,null,null,"Exploring Building Services Engineering","Construction and the Built Environment",25,"Exploring Building Services Engineering",60,"Internal"]
[null,null,null,null,null,null,"Exploring Facilities Management","Construction and the Built Environment",26,"Exploring Facilities Management",60,"Internal"]
[null,null,null,null,null,null,"Health and Safety in Engineering","Engineering",3,"Health and Safety in Engineering",30,"Internal"]
[null,null,null,null,null,null,"Engineering Maintenance","Engineering",4,"Engineering Maintenance",30,"Internal"]
[null,null,null,null,null,null,"Engineering Materials","Engineering",5,"Engineering Materials",30,"Internal"]
[null,null,null,null,null,null,"Computer-aided Engineering","Engineering",6,"Computer-aided Engineering",30,"Internal"]
[null,null,null,null,null,null,"Machining Techniques","Engineering",7,"Machining Techniques",60,"Internal"]
[null,null,null,null,null,null,"Electronic Circuit Design and Construction","Engineering",8,"Electronic Circuit Design and Construction",60,"Internal"]
[null,null,null,null,null,null,"Electrical and Mechanical Science for Engineering","Engineering",11,"Electrical and Mechanical Science for Engineering",30,"Internal"]
[null,null,null,null,null,null,"Engineering Design","Engineering",12,"Engineering Design",60,"Internal"]
[null,null,null,null,null,null,"Engineering Assembly","Engineering",13,"Engineering Assembly",30,"Internal"]
[null,null,null,null,null,null,"Vehicle Engines and Other Systems","Engineering",14,"Vehicle Engines and Other Systems",30,"Internal"]
[null,null,null,null,null,null,"Operating an Efficient Workplace","Engineering",15,"Operating an Efficient Workplace",60,"Internal"]
[null,null,null,null,null,null,"Vehicle Electrical Sytems","Engineering",16,"Vehicle Electrical Sytems",30,"Internal"]
[null,null,null,null,null,null,"Welding","Engineering",17,"Welding",60,"Internal"]
[null,null,null,null,null,null,"Computer Numerical Control Programming","Engineering",18,"Computer Numerical Control Programming",60,"Internal"]
[null,null,null,null,null,null,"Bicycle Servicing and Maintenance","Engineering",19,"Bicycle Servicing and Maintenance",30,"Internal"]
[null,null,null,null,null,null,"Sustainable Vehicle Power and Structure Design","Engineering",20,"Sustainable Vehicle Power and Structure Design",60,"Internal"]
[null,null,null,null,null,null,"Social Influences on Health and Wellbeing","Health and Social Care",4,"Social Influences on Health and Wellbeing",30,"Internal"]
[null,null,null,null,null,null,"Promoting Health and Wellbeing","Health and Social Care",5,"Promoting Health and Wellbeing",30,"Internal"]
[null,null,null,null,null,null,"The Impact of Nutrition on Health and Wellbeing","Health and Social Care",6,"The Impact of Nutrition on Health and Wellbeing",30,"Internal"]
[null,null,null,null,null,null,"Equality and Diversity in Health and Social Care","Health and Social Care",7,"Equality and Diversity in Health and Social Care",30,"Internal"]
[null,null,null,null,null,null,"Individual Rights in Health and Social Care","Health and Social Care",8,"Individual Rights in Health and Social Care",30,"Internal"]
[null,null,null,null,null,null,"Human Body Systems and Care of Disorders","Health and Social Care",10,"Human Body Systems and Care of Disorders",60,"Internal"]
[null,null,null,null,null,null,"Services in Health and Social Care","Health and Social Care",11,"Services in Health and Social Care",30,"Internal"]
[null,null,null,null,null,null,"Creative and Therapeutic Activities in Health and Social Care","Health and Social Care",12,"Creative and Therapeutic Activities in Health and Social Care",60,"Internal"]
[null,null,null,null,null,null,"The Health and Social Care Sector","Health and Social Care",13,"The Health and Social Care Sector",30,"Internal"]
[null,null,null,null,null,null,"The Early Years Sector","Health and Social Care",14,"The Early Years Sector",30,"Internal"]
[null,null,null,null,null,null,"Carrying out a Research Project in Health and Social Care","Health and Social Care",15,"Carrying out a Research Project in Health and Social Care",60,"Internal"]
[null,null,null,null,null,null,"Vocational Experience in Health and Social Care","Health and Social Care",16,"Vocational Experience in Health and Social Care",60,"Internal"]
[null,null,null,null,null,null,"Child Development and Observation","Health and Social Care",18,"Child Development and Observation",60,"Internal"]
[null,null,null,null,null,null,"An Introduction to Basic First Aid","Health and Social Care",22,"An Introduction to Basic First Aid",30,"Internal"]
[null,null,null,null,null,null,"Food Safety in Health and Social Care","Health and Social Care",23,"Food Safety in Health and Social Care",30,"Internal"]
[null,null,null,null,null,null,"Infection Control in Health and Social Care","Health and Social Care",24,"Infection Control in Health and Social Care",30,"Internal"]
[null,null,null,null,null,null,"Costing and Controlling Finances in the Hospitality Industry","Hospitality",4,"Costing and Controlling Finances in the Hospitality Industry",30,"Internal"]
[null,null,null,null,null,null,"Enterprise in the Hospitality Industry","Hospitality",5,"Enterprise in the Hospitality Industry",30,"Internal"]
[null,null,null,null,null,null,"Planning, Preparing, Cooking and Finishing Food","Hospitality",6,"Planning, Preparing, Cooking and Finishing Food",30,"Internal"]
[null,null,null,null,null,null,"Food and Beverage Service in the Hospitality Industry","Hospitality",7,"Food and Beverage Service in the Hospitality Industry",30,"Internal"]
[null,null,null,null,null,null,"Front Office Services in the Hospitality Industry","Hospitality",8,"Front Office Services in the Hospitality Industry",30,"Internal"]
[null,null,null,null,null,null,"Marketing and Promotion in Hospitality","Hospitality",10,"Marketing and Promotion in Hospitality",30,"Internal"]
[null,null,null,null,null,null,"Accommodation Services in the Hospitality Industry","Hospitality",11,"Accommodation Services in the Hospitality Industry",30,"Internal"]
[null,null,null,null,null,null,"Planning and Running a Hospitality Event","Hospitality",12,"Planning and Running a Hospitality Event",60,"Internal"]
[null,null,null,null,null,null,"Contemporary World Food Cooking Skills","Hospitality",13,"Contemporary World Food Cooking Skills",60,"Internal"]
[null,null,null,null,null,null,"Menu Planning","Hospitality",15,"Menu Planning",60,"Internal"]
[null,null,null,null,null,null,"Managing Finance in Hospitality","Hospitality",16,"Managing Finance in Hospitality",60,"Internal"]
[null,null,null,null,null,null,"Alcohol Awareness in Hospitality","Hospitality",17,"Alcohol Awareness in Hospitality",30,"Internal"]
[null,null,null,null,null,null,"Delivering the Hospitality Customer Experience","Hospitality",18,"Delivering the Hospitality Customer Experience",30,"Internal"]
[null,null,null,null,null,null,"Work Experience in Hospitality","Hospitality",20,"Work Experience in Hospitality",60,"Internal"]
[null,null,null,null,null,null,"Barista Skills in Hospitality","Hospitality",23,"Barista Skills in Hospitality",30,"Internal"]
[null,null,null,null,null,null,"Creating Digital Animation","Information and Creative Technology",4,"Creating Digital Animation",30,"Internal"]
[null,null,null,null,null,null,"Creating Digital Audio","Information and Creative Technology",5,"Creating Digital Audio",30,"Internal"]
[null,null,null,null,null,null,"Creating Digital Graphics","Information and Creative Technology",6,"Creating Digital Graphics",30,"Internal"]
[null,null,null,null,null,null,"Creating Digital Video","Information and Creative Technology",7,"Creating Digital Video",30,"Internal"]
[null,null,null,null,null,null,"Mobile Apps Development","Information and Creative Technology",8,"Mobile Apps Development",30,"Internal"]
[null,null,null,null,null,null,"Spreadsheet Development","Information and Creative Technology",9,"Spreadsheet Development",30,"Internal"]
[null,null,null,null,null,null,"Database Development","Information and Creative Technology",10,"Database Development",60,"Internal"]
[null,null,null,null,null,null,"Computer Networks","Information and Creative Technology",11,"Computer Networks",60,"Internal"]
[null,null,null,null,null,null,"Software Development","Information and Creative Technology",12,"Software Development",60,"Internal"]
[null,null,null,null,null,null,"Website Development","Information and Creative Technology",13,"Website Development",60,"Internal"]
[null,null,null,null,null,null,"Installing and Maintaining Computer Hardware","Information and Creative Technology",14,"Installing and Maintaining Computer Hardware",60,"Internal"]
[null,null,null,null,null,null,"Installing and Maintaining Computer Software","Information and Creative Technology",15,"Installing and Maintaining Computer Software",60,"Internal"]
[null,null,null,null,null,null,"Automated Computer Systems","Information and Creative Technology",16,"Automated Computer Systems",60,"Internal"]
[null,null,null,null,null,null,"Multimedia Products Development","Information and Creative Technology",17,"Multimedia Products Development",60,"Internal"]
[null,null,null,null,null,null,"Computational Thinking","Information and Creative Technology",18,"Computational Thinking",30,"Internal"]
[null,null,null,null,null,null,"Computing in the Workplace","Information and Creative Technology",19,"Computing in the Workplace",60,"Internal"]
[null,null,null,null,null,null,"Building a Personal Computer","Information and Creative Technology",20,"Building a Personal Computer",30,"Internal"]
[null,null,null,null,null,null,"A Technology Business","Information and Creative Technology",21,"A Technology Business",60,"Internal"]
[null,null,null,null,null,null,"Computer Security in Practice","Information and Creative Technology",22,"Computer Security in Practice",60,"Internal"]
[null,null,null,null,null,null,"Computer Systems Support in Practice","Information and Creative Technology",23,"Computer Systems Support in Practice",60,"Internal"]
[null,null,null,null,null,null,"Software Systems Development","Information and Creative Technology",24,"Software Systems Development",60,"Internal"]
[null,null,null,null,null,null,"IT Work Experience","Information and Creative Technology",25,"IT Work Experience",30,"Internal"]
[null,null,null,null,null,null,"Introducing Live Sound","Music",3,"Introducing Live Sound",30,"Internal"]
[null,null,null,null,null,null,"Introducing Music Composition","Music",4,"Introducing Music Composition",30,"Internal"]
[null,null,null,null,null,null,"Introducing Music Performance","Music",5,"Introducing Music Performance",30,"Internal"]
[null,null,null,null,null,null,"Introducing Music Recording","Music",6,"Introducing Music Recording",30,"Internal"]
[null,null,null,null,null,null,"Introducing Music Sequencing","Music",7,"Introducing Music Sequencing",30,"Internal"]
[null,null,null,null,null,null,"Introducing Choral Studies","Music",9,"Introducing Choral Studies",30,"Internal"]
[null,null,null,null,null,null,"Introducing Music Theory","Music",10,"Introducing Music Theory",30,"Internal"]
[null,null,null,null,null,null,"Developing Solo Music Performance","Music",11,"Developing Solo Music Performance",60,"Internal"]
[null,null,null,null,null,null,"The Development of Music","Music",12,"The Development of Music",60,"Internal"]
[null,null,null,null,null,null,"Developing Music Composition","Music",13,"Developing Music Composition",60,"Internal"]
[null,null,null,null,null,null,"Producing a Music Recording","Music",14,"Producing a Music Recording",60,"Internal"]
[null,null,null,null,null,null,"Music Ensemble","Music",15,"Music Ensemble",60,"Internal"]
[null,null,null,null,null,null,"Developing Modern Music Production Skills","Music",18,"Developing Modern Music Production Skills",60,"Internal"]
[null,null,null,null,null,null,"Developing Music Theory","Music",19,"Developing Music Theory",60,"Internal"]
[null,null,null,null,null,null,"Music Fusion","Music",20,"Music Fusion",60,"Internal"]
[null,null,null,null,null,null,"Music Arrangement","Music",21,"Music Arrangement",60,"Internal"]
[null,null,null,null,null,null,"Exploring Music Improvisation","Music",22,"Exploring Music Improvisation",60,"Internal"]
[null,null,null,null,null,null,"Exploring DJing","Music",23,"Exploring DJing",60,"Internal"]
[null,null,null,null,null,null,"Music Promotion","Music",24,"Music Promotion",60,"Internal"]
[null,null,null,null,null,null,"Digital and Mobile Technology for Music","Music",25,"Digital and Mobile Technology for Music",60,"Internal"]
[null,null,null,null,null,null,"Composing for Visual Media","Music",26,"Composing for Visual Media",60,"Internal"]
[null,null,null,null,null,null,"Enterprise and Music","Music",27,"Enterprise and Music",60,"Internal"]
[null,null,null,null,null,null,"Professional Skills in Music","Music",28,"Professional Skills in Music",60,"Internal"]
[null,null,null,null,null,null,"Acting Skills","Performing Arts",3,"Acting Skills",60,"Internal"]
[null,null,null,null,null,null,"Dance Skills","Performing Arts",4,"Dance Skills",60,"Internal"]
[null,null,null,null,null,null,"Musical Theatre Skills","Performing Arts",5,"Musical Theatre Skills",60,"Internal"]
[null,null,null,null,null,null,"Music Performance Skills","Performing Arts",6,"Music Performance Skills",60,"Internal"]
[null,null,null,null,null,null,"Production Skills for Performance","Performing Arts",7,"Production Skills for Performance",60,"Internal"]
[null,null,null,null,null,null,"Performance in Context","Performing Arts Acting",9,"Performance in Context",30,"Internal"]
[null,null,null,null,null,null,"Movement Skills","Performing Arts Acting",10,"Movement Skills",30,"Internal"]
[null,null,null,null,null,null,"Devising Performance Work","Performing Arts Acting",11,"Devising Performance Work",30,"Internal"]
[null,null,null,null,null,null,"Exploring Improvisation","Performing Arts Acting",12,"Exploring Improvisation",30,"Internal"]
[null,null,null,null,null,null,"Multimedia Performance","Performing Arts Acting",13,"Multimedia Performance",30,"Internal"]
[null,null,null,null,null,null,"Voice and Speech for Performers","Performing Arts Acting",14,"Voice and Speech for Performers",30,"Internal"]
[null,null,null,null,null,null,"Performing Scripted Plays","Performing Arts Acting",15,"Performing Scripted Plays",30,"Internal"]
[null,null,null,null,null,null,"Community Arts","Performing Arts Acting",31,"Community Arts",60,"Internal"]
[null,null,null,null,null,null,"Directing Performance","Performing Arts Acting",32,"Directing Performance",60,"Internal"]
[null,null,null,null,null,null,"Planning and Managing a Performing Arts Event","Performing Arts Acting",33,"Planning and Managing a Performing Arts Event",60,"Internal"]
[null,null,null,null,null,null,"Physical Theatre Performance","Performing Arts Acting",35,"Physical Theatre Performance",60,"Internal"]
[null,null,null,null,null,null,"Variety Performance","Performing Arts Acting",36,"Variety Performance",60,"Internal"]
[null,null,null,null,null,null,"Performing Arts Enterprise","Performing Arts Acting",37,"Performing Arts Enterprise",60,"Internal"]
[null,null,null,null,null,null,"Use of ICT in the Performing Arts","Performing Arts Acting",38,"Use of ICT in the Performing Arts",30,"Internal"]
[null,null,null,null,null,null,"Work Experience in the Performing Arts","Performing Arts Acting",39,"Work Experience in the Performing Arts",30,"Internal"]
[null,null,null,null,null,null,"Singing Skills in the Performing Arts","Performing Arts Acting",40,"Singing Skills in the Performing Arts",60,"Internal"]
[null,null,null,null,null,null,"Performance in Context","Performing Arts Dance",9,"Performance in Context",30,"Internal"]
[null,null,null,null,null,null,"Movement Skills","Performing Arts Dance",10,"Movement Skills",30,"Internal"]
[null,null,null,null,null,null,"Devising Performance Work","Performing Arts Dance",11,"Devising Performance Work",30,"Internal"]
[null,null,null,null,null,null,"Exploring Improvisation","Performing Arts Dance",12,"Exploring Improvisation",30,"Internal"]
[null,null,null,null,null,null,"Multimedia Performance","Performing Arts Dance",13,"Multimedia Performance",30,"Internal"]
[null,null,null,null,null,null,"Contemporary Dance Techniques","Performing Arts Dance",16,"Contemporary Dance Techniques",30,"Internal"]
[null,null,null,null,null,null,"Exploring Urban Dance Styles","Performing Arts Dance",17,"Exploring Urban Dance Styles",30,"Internal"]
[null,null,null,null,null,null,"Jazz Dance Techniques","Performing Arts Dance",18,"Jazz Dance Techniques",30,"Internal"]
[null,null,null,null,null,null,"Community Arts","Performing Arts Dance",31,"Community Arts",60,"Internal"]
[null,null,null,null,null,null,"Physical Theatre Performance","Performing Arts Dance",35,"Physical Theatre Performance",60,"Internal"]
[null,null,null,null,null,null,"Variety Performance","Performing Arts Dance",36,"Variety Performance",60,"Internal"]
[null,null,null,null,null,null,"Performing Arts Enterprise","Performing Arts Dance",37,"Performing Arts Enterprise",60,"Internal"]
[null,null,null,null,null,null,"Singing Skills in the Performing Arts","Performing Arts Dance",40,"Singing Skills in the Performing Arts",60,"Internal"]
[null,null,null,null,null,null,"Performance in Context","Performing Arts Production",9,"Performance in Context",30,"Internal"]
[null,null,null,null,null,null,"Design Planning for Performance","Performing Arts Production",19,"Design Planning for Performance",30,"Internal"]
[null,null,null,null,null,null,"Realising Costume Design for Performance","Performing Arts Production",20,"Realising Costume Design for Performance",30,"Internal"]
[null,null,null,null,null,null,"Realising Set Design for Performance","Performing Arts Production",21,"Realising Set Design for Performance",30,"Internal"]
[null,null,null,null,null,null,"Realising Prop Design for Performance","Performing Arts Production",22,"Realising Prop Design for Performance",30,"Internal"]
[null,null,null,null,null,null,"Realising Mask Design for Performance","Performing Arts Production",23,"Realising Mask Design for Performance",30,"Internal"]
[null,null,null,null,null,null,"Lighting for Performance","Performing Arts Production",24,"Lighting for Performance",30,"Internal"]
[null,null,null,null,null,null,"Sound for Performance","Performing Arts Production",25,"Sound for Performance",30,"Internal"]
[null,null,null,null,null,null,"Supporting Performance: Stage Management","Performing Arts Production",26,"Supporting Performance: Stage Management",30,"Internal"]
[null,null,null,null,null,null,"Supporting Performance: Front of House","Performing Arts Production",27,"Supporting Performance: Front of House",30,"Internal"]
[null,null,null,null,null,null,"Make-up for Performance","Performing Arts Production",28,"Make-up for Performance",30,"Internal"]
[null,null,null,null,null,null,"Wardrobe for Stage Performance","Performing Arts Production",29,"Wardrobe for Stage Performance",30,"Internal"]
[null,null,null,null,null,null,"Employment in the Public Services","Public Services",3,"Employment in the Public Services",30,"Internal"]
[null,null,null,null,null,null,"Public Services and Community Protection","Public Services",4,"Public Services and Community Protection",30,"Internal"]
[null,null,null,null,null,null,"Health, Fitness and Lifestyle for the Public Services","Public Services",5,"Health, Fitness and Lifestyle for the Public Services",30,"Internal"]
[null,null,null,null,null,null,"Promotion of Public Services Provision","Public Services",8,"Promotion of Public Services Provision",30,"Internal"]
[null,null,null,null,null,null,"Community and Cultural Awareness","Public Services",9,"Community and Cultural Awareness",30,"Internal"]
[null,null,null,null,null,null,"Adventurous Activities in the Public Services","Public Services",10,"Adventurous Activities in the Public Services",30,"Internal"]
[null,null,null,null,null,null,"Sport and Recreation in the Public Services","Public Services",11,"Sport and Recreation in the Public Services",30,"Internal"]
[null,null,null,null,null,null,"Land Navigation by Map and Compass","Public Services",12,"Land Navigation by Map and Compass",60,"Internal"]
[null,null,null,null,null,null,"Volunteering for the Public Services","Public Services",13,"Volunteering for the Public Services",60,"Internal"]
[null,null,null,null,null,null,"Multi-day Expedition Experience","Public Services",14,"Multi-day Expedition Experience",60,"Internal"]
[null,null,null,null,null,null,"Health and Safety in the Public Services","Public Services",15,"Health and Safety in the Public Services",30,"Internal"]
[null,null,null,null,null,null,"Employability Skills in the Public Services","Public Services",16,"Employability Skills in the Public Services",30,"Internal"]
[null,null,null,null,null,null,"Preparing to Respond to Emergency Incidents","Public Services",17,"Preparing to Respond to Emergency Incidents",60,"Internal"]
[null,null,null,null,null,null,"Security Procedures in the Public Services","Public Services",18,"Security Procedures in the Public Services",60,"Internal"]
[null,null,null,null,null,null,"Carrying out a Project in Public Services","Public Services",19,"Carrying out a Project in Public Services",60,"Internal"]
[null,null,null,null,null,null,"Law and its Impact on the Individual","Public Services",20,"Law and its Impact on the Individual",60,"Internal"]
[null,null,null,null,null,null,"The Mind and Sports Performance","Sport",3,"The Mind and Sports Performance",30,"Internal"]
[null,null,null,null,null,null,"The Sports Performer in Action","Sport",4,"The Sports Performer in Action",30,"Internal"]
[null,null,null,null,null,null,"Training for Personal Fitness","Sport",5,"Training for Personal Fitness",30,"Internal"]
[null,null,null,null,null,null,"Leading Sports Activities","Sport",6,"Leading Sports Activities",30,"Internal"]
[null,null,null,null,null,null,"Promotion and Sponsorship in Sport","Sport",8,"Promotion and Sponsorship in Sport",30,"Internal"]
[null,null,null,null,null,null,"Lifestyle and Well-being","Sport",9,"Lifestyle and Well-being",30,"Internal"]
[null,null,null,null,null,null,"Injury and the Sports Performer","Sport",10,"Injury and the Sports Performer",30,"Internal"]
[null,null,null,null,null,null,"Running a Sports Event","Sport",11,"Running a Sports Event",30,"Internal"]
[null,null,null,null,null,null,"The Sport and Active Leisure Industry","Sport",12,"The Sport and Active Leisure Industry",30,"Internal"]
[null,null,null,null,null,null,"Profiling Sports Performance","Sport",13,"Profiling Sports Performance",30,"Internal"]
[null,null,null,null,null,null,"Carrying Out a Sports-related Project","Sport",14,"Carrying Out a Sports-related Project",60,"Internal"]
[null,null,null,null,null,null,"Designing Exercise Programmes","Sport",15,"Designing Exercise Programmes",60,"Internal"]
[null,null,null,null,null,null,"Expedition Experience","Sport",18,"Expedition Experience",60,"Internal"]
[null,null,null,null,null,null,"Practical Land-based Outdoor and Adventurous Activities","Sport",19,"Practical Land-based Outdoor and Adventurous Activities",60,"Internal"]
[null,null,null,null,null,null,"Practical Water-based Outdoor and Adventurous Activities","Sport",20,"Practical Water-based Outdoor and Adventurous Activities",60,"Internal"]
[null,null,null,null,null,null,"Land-based Outdoor and Adventurous Activity Leadership","Sport",21,"Land-based Outdoor and Adventurous Activity Leadership",60,"Internal"]
[null,null,null,null,null,null,"Water-based Outdoor and Adventurous Activity Leadership","Sport",22,"Water-based Outdoor and Adventurous Activity Leadership",60,"Internal"]
[null,null,null,null,null,null,"Work Experience in Sport","Sport",24,"Work Experience in Sport",60,"Internal"]
[null,null,null,null,null,null,"The Development of Travel and Tourism in the UK","Travel and Tourism",3,"The Development of Travel and Tourism in the UK",30,"Internal"]
[null,null,null,null,null,null,"Factors Affecting Worldwide Travel and Tourism","Travel and Tourism",5,"Factors Affecting Worldwide Travel and Tourism",30,"Internal"]
[null,null,null,null,null,null,"The Travel and Tourism Customer Experience","Travel and Tourism",6,"The Travel and Tourism Customer Experience",30,"Internal"]
[null,null,null,null,null,null,"Promotion and Sales in Travel and Tourism","Travel and Tourism",8,"Promotion and Sales in Travel and Tourism",30,"Internal"]
[null,null,null,null,null,null,"Travel and Tourism Employment Opportunities","Travel and Tourism",9,"Travel and Tourism Employment Opportunities",30,"Internal"]
[null,null,null,null,null,null,"Organising a Travel and Tourism Study Visit","Travel and Tourism",10,"Organising a Travel and Tourism Study Visit",30,"Internal"]
[null,null,null,null,null,null,"Delivering the Travel and Tourism Customer Experience","Travel and Tourism",11,"Delivering the Travel and Tourism Customer Experience",60,"Internal"]
[null,null,null,null,null,null,"Marketing in Travel and Tourism","Travel and Tourism",12,"Marketing in Travel and Tourism",60,"Internal"]
[null,null,null,null,null,null,"Airports and Airlines","Travel and Tourism",13,"Airports and Airlines",60,"Internal"]
[null,null,null,null,null,null,"Work-related Experience in Travel and Tourism","Travel and Tourism",15,"Work-related Experience in Travel and Tourism",60,"Internal"]
[null,null,null,null,null,null,"Holiday Representatives","Travel and Tourism",16,"Holiday Representatives",30,"Internal"]
[null,null,null,null,null,null,"UK Travel Agency Operations","Travel and Tourism",17,"UK Travel Agency Operations",30,"Internal"]
[null,null,null,null,null,null,"The Cruise Industry","Travel and Tourism",18,"The Cruise Industry",30,"Internal"]
[null,null,null,null,null,null,"Hospitality Operations in the Travel and Tourism Sector","Travel and Tourism",19,"Hospitality Operations in the Travel and Tourism Sector",30,"Internal"]
[null,null,null,null,null,null,"UK Visitor Attractions","Travel and Tourism",20,"UK Visitor Attractions",30,"Internal"]
[null,null,null,null,null,null,"Digital Moving Image Production","Creative Digital Media Production",3,"Digital Moving Image Production",30,"Internal"]
[null,null,null,null,null,null,"Digital Audio Production","Creative Digital Media Production",4,"Digital Audio Production",30,"Internal"]
[null,null,null,null,null,null,"Digital Publishing Production","Creative Digital Media Production",5,"Digital Publishing Production",30,"Internal"]
[null,null,null,null,null,null,"Website Production","Creative Digital Media Production",6,"Website Production",30,"Internal"]
[null,null,null,null,null,null,"Digital Games Production","Creative Digital Media Production",7,"Digital Games Production",30,"Internal"]

{"sheet":"Ext Cert Dropdown","index":12,"n_rows":48,"n_cols":111,"rows_kept":48,"cut":false,"hidden":true,"merged":[]}
["Applied Science A",null,null,null,"Art and Design A",null,null,null,"Design Crafts",null,null,null,"Fashion and Textiles",null,null,null,"Photography",null,null,null,"Product Design",null,null,null,"Visual Arts",null,null,null,"Visual Communication",null,null,null,"Business",null,null,null,"Construction",null,null,null,"Engineering",null,null,null,"HSC",null,null,null,"Hospitality",null,null,null,"I&CT",null,null,null,"Music",null,null,null,"PA A",null,null,null,"PA B",null,null,null,"Acting A",null,null,null,"Acting B",null,null,null,"Dance A",null,null,null,"Dance B",null,null,null,"Production A",null,null,null,"Production B",null,null,null,"Public Services",null,null,null,"Sport",null,null,null,"Travel and Tourism",null,null,null,"Creative Digital Media Production A",null,null,null,"Creative Digital Media Production B"]
["Practical Scientific Project",{"$f":"IF(COUNTIF('Ext Cert'!$E$20:$E$83,A2)>=1,\"\",ROW())","v":2},{"$f":"IF(ROW(A2)-ROW(A$2)+1>COUNT(B$2:B$50),\"\",INDEX(A:A,SMALL(B$2:B$50,1+ROW(A2)-ROW(A$2))))","v":"Practical Scientific Project"},null,"Communicating Ideas in 2D",{"$f":"IF(OR(COUNTIF('Ext Cert'!$E$20:$E$83,E2)>=1,COUNTIF('Ext Cert'!$E$20:$E$83,E8)>=1,COUNTIF('Ext Cert'!$E$20:$E$83,E10)>=1,COUNTIF('Ext Cert'!$E$20:$E$83,E18)>=1),\"\",ROW())","v":2},{"$f":"IF(ROW(E2)-ROW(E$2)+1>COUNT(F$2:F$50),\"\",INDEX(E:E,SMALL(F$2:F$50,1+ROW(E2)-ROW(E$2))))","v":"Communicating Ideas in 2D"},null,"Communicating Ideas in 2D",{"$f":"IF(OR(COUNTIF('Ext Cert'!$E$20:$E$83,I2)>=1,COUNTIF('Ext Cert'!$E$20:$E$83,I9)>=1),\"\",ROW())","v":2},{"$f":"IF(ROW(I2)-ROW(I$2)+1>COUNT(J$2:J$50),\"\",INDEX(I:I,SMALL(J$2:J$50,1+ROW(I2)-ROW(I$2))))","v":"Communicating Ideas in 2D"},null,"Communicating Ideas in 2D",{"$f":"IF(COUNTIF('Ext Cert'!$E$20:$E$83,M2)>=1,\"\",ROW())","v":2},{"$f":"IF(ROW(M2)-ROW(M$2)+1>COUNT(N$2:N$50),\"\",INDEX(M:M,SMALL(N$2:N$50,1+ROW(M2)-ROW(M$2))))","v":"Communicating Ideas in 2D"},null,"Communicating Ideas in 2D",{"$f":"IF(COUNTIF('Ext Cert'!$E$20:$E$83,Q2)>=1,\"\",ROW())","v":2},{"$f":"IF(ROW(Q2)-ROW(Q$2)+1>COUNT(R$2:R$50),\"\",INDEX(Q:Q,SMALL(R$2:R$50,1+ROW(Q2)-ROW(Q$2))))","v":"Communicating Ideas in 2D"},null,"Communicating Ideas in 2D",{"$f":"IF(OR(COUNTIF('Ext Cert'!$E$20:$E$83,U2)>=1,COUNTIF('Ext Cert'!$E$20:$E$83,U7)>=1),\"\",ROW())","v":2},{"$f":"IF(ROW(U2)-ROW(U$2)+1>COUNT(V$2:V$50),\"\",INDEX(U:U,SMALL(V$2:V$50,1+ROW(U2)-ROW(U$2))))","v":"Communicating Ideas in 2D"},null,"Developing an Art and Design Portfolio",{"$f":"IF(COUNTIF('Ext Cert'!$E$20:$E$83,Y2)>=1,\"\",ROW())","v":2},{"$f":"IF(ROW(Y2)-ROW(Y$2)+1>COUNT(Z$2:Z$50),\"\",INDEX(Y:Y,SMALL(Z$2:Z$50,1+ROW(Y2)-ROW(Y$2))))","v":"Developing an Art and Design Portfolio"},null,"Communicating Ideas in 3D",{"$f":"IF(OR(COUNTIF('Ext Cert'!$E$20:$E$83,AC2)>=1,COUNTIF('Ext Cert'!$E$20:$E$83,AC6)>=1,COUNTIF('Ext Cert'!$E$20:$E$83,AC20)>=1),\"\",ROW())","v":2},{"$f":"IF(ROW(AC2)-ROW(AC$2)+1>COUNT(AD$2:AD$50),\"\",INDEX(AC:AC,SMALL(AD$2:AD$50,1+ROW(AC2)-ROW(AC$2))))","v":"Communicating Ideas in 3D"},null,"Promoting a Brand",{"$f":"IF(COUNTIF('Ext Cert'!$E$20:$E$83,AG2)>=1,\"\",ROW())","v":2},{"$f":"IF(ROW(AG2)-ROW(AG$2)+1>COUNT(AH$2:AH$50),\"\",INDEX(AG:AG,SMALL(AH$2:AH$50,1+ROW(AG2)-ROW(AG$2))))","v":"Promoting a Brand"},null,"Construction Processes and Operations",{"$f":"IF(COUNTIF('Ext Cert'!$E$20:$E$83,AK2)>=1,\"\",ROW())","v":2},{"$f":"IF(ROW(AK2)-ROW(AK$2)+1>COUNT(AL$2:AL$50),\"\",INDEX(AK:AK,SMALL(AL$2:AL$50,1+ROW(AK2)-ROW(AK$2))))","v":"Construction Processes and Operations"},null,"Health and Safety in Engineering",{"$f":"IF(COUNTIF('Ext Cert'!$E$20:$E$83,AO2)>=1,\"\",ROW())","v":2},{"$f":"IF(ROW(AO2)-ROW(AO$2)+1>COUNT(AP$2:AP$50),\"\",INDEX(AO:AO,SMALL(AP$2:AP$50,1+ROW(AO2)-ROW(AO$2))))","v":"Health and Safety in Engineering"},null,"Social Influences on Health and Wellbeing",{"$f":"IF(COUNTIF('Ext Cert'!$E$20:$E$83,AS2)>=1,\"\",ROW())","v":2},{"$f":"IF(ROW(AS2)-ROW(AS$2)+1>COUNT(AT$2:AT$50),\"\",INDEX(AS:AS,SMALL(AT$2:AT$50,1+ROW(AS2)-ROW(AS$2))))","v":"Social Influences on Health and Wellbeing"},null,"Costing and Controlling Finances in the Hospitality Industry",{"$f":"IF(COUNTIF('Ext Cert'!$E$20:$E$83,AW2)>=1,\"\",ROW())","v":2},{"$f":"IF(ROW(AW2)-ROW(AW$2)+1>COUNT(AX$2:AX$50),\"\",INDEX(AW:AW,SMALL(AX$2:AX$50,1+ROW(AW2)-ROW(AW$2))))","v":"Costing and Controlling Finances in the Hospitality Industry"},null,"Creating Digital Animation",{"$f":"IF(COUNTIF('Ext Cert'!$E$20:$E$83,BA2)>=1,\"\",ROW())","v":2},{"$f":"IF(ROW(BA2)-ROW(BA$2)+1>COUNT(BB$2:BB$50),\"\",INDEX(BA:BA,SMALL(BB$2:BB$50,1+ROW(BA2)-ROW(BA$2))))","v":"Creating Digital Animation"},null,"Introducing Live Sound",{"$f":"IF(COUNTIF('Ext Cert'!$E$20:$E$83,BE2)>=1,\"\",ROW())","v":2},{"$f":"IF(ROW(BE2)-ROW(BE$2)+1>COUNT(BF$2:BF$50),\"\",INDEX(BE:BE,SMALL(BF$2:BF$50,1+ROW(BE2)-ROW(BE$2))))","v":"Introducing Live Sound"},null,"Acting Skills",{"$f":"IF(COUNTIF('Ext Cert'!$E$20:$E$83,BI2)>=1,\"\",ROW())","v":2},{"$f":"IF(ROW(BI2)-ROW(BI$2)+1>COUNT(BJ$2:BJ$50),\"\",INDEX(BI:BI,SMALL(BJ$2:BJ$50,1+ROW(BI2)-ROW(BI$2))))","v":"Acting Skills"},null,"Performance in Context",{"$f":"IF(COUNTIF('Ext Cert'!$E$20:$E$83,BM2)>=1,\"\",ROW())","v":2},{"$f":"IF(ROW(BM2)-ROW(BM$2)+1>COUNT(BN$2:BN$50),\"\",INDEX(BM:BM,SMALL(BN$2:BN$50,1+ROW(BM2)-ROW(BM$2))))","v":"Performance in Context"},null,"Performance in Context",{"$f":"IF(COUNTIF('Ext Cert'!$E$20:$E$83,BQ2)>=1,\"\",ROW())","v":2},{"$f":"IF(ROW(BQ2)-ROW(BQ$2)+1>COUNT(BR$2:BR$50),\"\",INDEX(BQ:BQ,SMALL(BR$2:BR$50,1+ROW(BQ2)-ROW(BQ$2))))","v":"Performance in Context"},null,"Contemporary Dance Techniques",{"$f":"IF(COUNTIF('Ext Cert'!$E$20:$E$83,BU2)>=1,\"\",ROW())","v":2},{"$f":"IF(ROW(BU2)-ROW(BU$2)+1>COUNT(BV$2:BV$50),\"\",INDEX(BU:BU,SMALL(BV$2:BV$50,1+ROW(BU2)-ROW(BU$2))))","v":"Contemporary Dance Techniques"},null,"Performance in Context",{"$f":"IF(COUNTIF('Ext Cert'!$E$20:$E$83,BY2)>=1,\"\",ROW())","v":2},{"$f":"IF(ROW(BY2)-ROW(BY$2)+1>COUNT(BZ$2:BZ$50),\"\",INDEX(BY:BY,SMALL(BZ$2:BZ$50,1+ROW(BY2)-ROW(BY$2))))","v":"Performance in Context"},null,"Voice and Speech for Performers",{"$f":"IF(COUNTIF('Ext Cert'!$E$20:$E$83,CC2)>=1,\"\",ROW())","v":2},{"$f":"IF(ROW(CC2)-ROW(CC$2)+1>COUNT(CD$2:CD$50),\"\",INDEX(CC:CC,SMALL(CD$2:CD$50,1+ROW(CC2)-ROW(CC$2))))","v":"Voice and Speech for Performers"},null,"Performance in Context",{"$f":"IF(COUNTIF('Ext Cert'!$E$20:$E$83,CG2)>=1,\"\",ROW())","v":2},{"$f":"IF(ROW(CG2)-ROW(CG$2)+1>COUNT(CH$2:CH$50),\"\",INDEX(CG:CG,SMALL(CH$2:CH$50,1+ROW(CG2)-ROW(CG$2))))","v":"Performance in Context"},null,"Movement Skills",{"$f":"IF(COUNTIF('Ext Cert'!$E$20:$E$83,CK2)>=1,\"\",ROW())","v":2},{"$f":"IF(ROW(CK2)-ROW(CK$2)+1>COUNT(CL$2:CL$50),\"\",INDEX(CK:CK,SMALL(CL$2:CL$50,1+ROW(CK2)-ROW(CK$2))))","v":"Movement Skills"},null,"Employment in the Public Services",{"$f":"IF(COUNTIF('Ext Cert'!$E$20:$E$83,CO2)>=1,\"\",ROW())","v":2},{"$f":"IF(ROW(CO2)-ROW(CO$2)+1>COUNT(CP$2:CP$50),\"\",INDEX(CO:CO,SMALL(CP$2:CP$50,1+ROW(CO2)-ROW(CO$2))))","v":"Employment in the Public Services"},null,"The Mind and Sports Performance",{"$f":"IF(COUNTIF('Ext Cert'!$E$20:$E$83,CS2)>=1,\"\",ROW())","v":2},{"$f":"IF(ROW(CS2)-ROW(CS$2)+1>COUNT(CT$2:CT$50),\"\",INDEX(CS:CS,SMALL(CT$2:CT$50,1+ROW(CS2)-ROW(CS$2))))","v":"The Mind and Sports Performance"},null,"The Development of Travel and Tourism in the UK",{"$f":"IF(COUNTIF('Ext Cert'!$E$20:$E$83,CW2)>=1,\"\",ROW())","v":2},{"$f":"IF(ROW(CW2)-ROW(CW$2)+1>COUNT(CX$2:CX$50),\"\",INDEX(CW:CW,SMALL(CX$2:CX$50,1+ROW(CW2)-ROW(CW$2))))","v":"The Development of Travel and Tourism in the UK"},null,"Digital Moving Image Production",{"$f":"IF(COUNTIF('Ext Cert'!$E$20:$E$83,DA2)>=1,\"\",ROW())","v":2},{"$f":"IF(ROW(DA2)-ROW(DA$2)+1>COUNT(DB$2:DB$50),\"\",INDEX(DA:DA,SMALL(DB$2:DB$50,1+ROW(DA2)-ROW(DA$2))))","v":"Digital Moving Image Production"},null,"Digital Editing for Moving Image",{"$f":"IF(COUNTIF('Ext Cert'!$E$20:$E$83,DE2)>=1,\"\",ROW())","v":2},{"$f":"IF(ROW(DE2)-ROW(DE$2)+1>COUNT(DF$2:DF$50),\"\",INDEX(DE:DE,SMALL(DF$2:DF$50,1+ROW(DE2)-ROW(DE$2))))","v":"Digital Editing for Moving Image"}]
["World Energy",{"$f":"IF(COUNTIF('Ext Cert'!$E$20:$E$83,A3)>=1,\"\",ROW())","v":3},{"$f":"IF(ROW(A3)-ROW(A$2)+1>COUNT(B$2:B$50),\"\",INDEX(A:A,SMALL(B$2:B$50,1+ROW(A3)-ROW(A$2))))","v":"World Energy"},null,"Communicating Ideas in 3D",{"$f":"IF(OR(COUNTIF('Ext Cert'!$E$20:$E$83,E3)>=1,COUNTIF('Ext Cert'!$E$20:$E$83,E6)>=1,COUNTIF('Ext Cert'!$E$20:$E$83,E10)>=1,COUNTIF('Ext Cert'!$E$20:$E$83,E15)>=1,COUNTIF('Ext Cert'!$E$20:$E$83,E19)>=1,COUNTIF('Ext Cert'!$E$20:$E$83,E37)>=1),\"\",ROW())","v":3},{"$f":"IF(ROW(E3)-ROW(E$2)+1>COUNT(F$2:F$50),\"\",INDEX(E:E,SMALL(F$2:F$50,1+ROW(E3)-ROW(E$2))))","v":"Communicating Ideas in 3D"},null,"Developing an Art and Design Portfolio",{"$f":"IF(COUNTIF('Ext Cert'!$E$20:$E$83,I3)>=1,\"\",ROW())","v":3},{"$f":"IF(ROW(I3)-ROW(I$2)+1>COUNT(J$2:J$50),\"\",INDEX(I:I,SMALL(J$2:J$50,1+ROW(I3)-ROW(I$2))))","v":"Developing an Art and Design Portfolio"},null,"Developing an Art and Design Portfolio",{"$f":"IF(COUNTIF('Ext Cert'!$E$20:$E$83,M3)>=1,\"\",ROW())","v":3},{"$f":"IF(ROW(M3)-ROW(M$2)+1>COUNT(N$2:N$50),\"\",INDEX(M:M,SMALL(N$2:N$50,1+ROW(M3)-ROW(M$2))))","v":"Developing an Art and Design Portfolio"},null,"Communicating Ideas in 3D",{"$f":"IF(OR(COUNTIF('Ext Cert'!$E$20:$E$83,Q3)>=1,COUNTIF('Ext Cert'!$E$20:$E$83,Q11)>=1),\"\",ROW())","v":3},{"$f":"IF(ROW(Q3)-ROW(Q$2)+1>COUNT(R$2:R$50),\"\",INDEX(Q:Q,SMALL(R$2:R$50,1+ROW(Q3)-ROW(Q$2))))","v":"Communicating Ideas in 3D"},null,"Communicating Ideas in 3D",{"$f":"IF(COUNTIF('Ext Cert'!$E$20:$E$83,U3)>=1,\"\",ROW())","v":3},{"$f":"IF(ROW(U3)-ROW(U$2)+1>COUNT(V$2:V$50),\"\",INDEX(U:U,SMALL(V$2:V$50,1+ROW(U3)-ROW(U$2))))","v":"Communicating Ideas in 3D"},null,"Using Mobile Devices in Art and Design",{"$f":"IF(COUNTIF('Ext Cert'!$E$20:$E$83,Y3)>=1,\"\",ROW())","v":3},{"$f":"IF(ROW(Y3)-ROW(Y$2)+1>COUNT(Z$2:Z$50),\"\",INDEX(Y:Y,SMALL(Z$2:Z$50,1+ROW(Y3)-ROW(Y$2))))","v":"Using Mobile Devices in Art and Design"},null,"Developing an Art and Design Portfolio",{"$f":"IF(COUNTIF('Ext Cert'!$E$20:$E$83,AC3)>=1,\"\",ROW())","v":3},{"$f":"IF(ROW(AC3)-ROW(AC$2)+1>COUNT(AD$2:AD$50),\"\",INDEX(AC:AC,SMALL(AD$2:AD$50,1+ROW(AC3)-ROW(AC$2))))","v":"Developing an Art and Design Portfolio"},null,"Principles of Customer Services",{"$f":"IF(COUNTIF('Ext Cert'!$E$20:$E$83,AG3)>=1,\"\",ROW())","v":3},{"$f":"IF(ROW(AG3)-ROW(AG$2)+1>COUNT(AH$2:AH$50),\"\",INDEX(AG:AG,SMALL(AH$2:AH$50,1+ROW(AG3)-ROW(AG$2))))","v":"Principles of Customer Services"},null,"Construction Drawing Techniques",{"$f":"IF(COUNTIF('Ext Cert'!$E$20:$E$83,AK3)>=1,\"\",ROW())","v":3},{"$f":"IF(ROW(AK3)-ROW(AK$2)+1>COUNT(AL$2:AL$50),\"\",INDEX(AK:AK,SMALL(AL$2:AL$50,1+ROW(AK3)-ROW(AK$2))))","v":"Construction Drawing Techniques"},null,"Engineering Maintenance",{"$f":"IF(COUNTIF('Ext Cert'!$E$20:$E$83,AO3)>=1,\"\",ROW())","v":3},{"$f":"IF(ROW(AO3)-ROW(AO$2)+1>COUNT(AP$2:AP$50),\"\",INDEX(AO:AO,SMALL(AP$2:AP$50,1+ROW(AO3)-ROW(AO$2))))","v":"Engineering Maintenance"},null,"Promoting Health and Wellbeing",{"$f":"IF(COUNTIF('Ext Cert'!$E$20:$E$83,AS3)>=1,\"\",ROW())","v":3},{"$f":"IF(ROW(AS3)-ROW(AS$2)+1>COUNT(AT$2:AT$50),\"\",INDEX(AS:AS,SMALL(AT$2:AT$50,1+ROW(AS3)-ROW(AS$2))))","v":"Promoting Health and Wellbeing"},null,"Enterprise in the Hospitality Industry",{"$f":"IF(COUNTIF('Ext Cert'!$E$20:$E$83,AW3)>=1,\"\",ROW())","v":3},{"$f":"IF(ROW(AW3)-ROW(AW$2)+1>COUNT(AX$2:AX$50),\"\",INDEX(AW:AW,SMALL(AX$2:AX$50,1+ROW(AW3)-ROW(AW$2))))","v":"Enterprise in the Hospitality Industry"},null,"Creating Digital Audio",{"$f":"IF(COUNTIF('Ext Cert'!$E$20:$E$83,BA3)>=1,\"\",ROW())","v":3},{"$f":"IF(ROW(BA3)-ROW(BA$2)+1>COUNT(BB$2:BB$50),\"\",INDEX(BA:BA,SMALL(BB$2:BB$50,1+ROW(BA3)-ROW(BA$2))))","v":"Creating Digital Audio"},null,"Introducing Music Composition",{"$f":"IF(COUNTIF('Ext Cert'!$E$20:$E$83,BE3)>=1,\"\",ROW())","v":3},{"$f":"IF(ROW(BE3)-ROW(BE$2)+1>COUNT(BF$2:BF$50),\"\",INDEX(BE:BE,SMALL(BF$2:BF$50,1+ROW(BE3)-ROW(BE$2))))","v":"Introducing Music Composition"},null,"Dance Skills",{"$f":"IF(COUNTIF('Ext Cert'!$E$20:$E$83,BI3)>=1,\"\",ROW())","v":3},{"$f":"IF(ROW(BI3)-ROW(BI$2)+1>COUNT(BJ$2:BJ$50),\"\",INDEX(BI:BI,SMALL(BJ$2:BJ$50,1+ROW(BI3)-ROW(BI$2))))","v":"Dance Skills"},null,"Movement Skills",{"$f":"IF(COUNTIF('Ext Cert'!$E$20:$E$83,BM3)>=1,\"\",ROW())","v":3},{"$f":"IF(ROW(BM3)-ROW(BM$2)+1>COUNT(BN$2:BN$50),\"\",INDEX(BM:BM,SMALL(BN$2:BN$50,1+ROW(BM3)-ROW(BM$2))))","v":"Movement Skills"},null,"Movement Skills",{"$f":"IF(COUNTIF('Ext Cert'!$E$20:$E$83,BQ3)>=1,\"\",ROW())","v":3},{"$f":"IF(ROW(BQ3)-ROW(BQ$2)+1>COUNT(BR$2:BR$50),\"\",INDEX(BQ:BQ,SMALL(BR$2:BR$50,1+ROW(BQ3)-ROW(BQ$2))))","v":"Movement Skills"},null,"Exploring Urban Dance Styles",{"$f":"IF(COUNTIF('Ext Cert'!$E$20:$E$83,BU3)>=1,\"\",ROW())","v":3},{"$f":"IF(ROW(BU3)-ROW(BU$2)+1>COUNT(BV$2:BV$50),\"\",INDEX(BU:BU,SMALL(BV$2:BV$50,1+ROW(BU3)-ROW(BU$2))))","v":"Exploring Urban Dance Styles"},null,"Movement Skills",{"$f":"IF(COUNTIF('Ext Cert'!$E$20:$E$83,BY3)>=1,\"\",ROW())","v":3},{"$f":"IF(ROW(BY3)-ROW(BY$2)+1>COUNT(BZ$2:BZ$50),\"\",INDEX(BY:BY,SMALL(BZ$2:BZ$50,1+ROW(BY3)-ROW(BY$2))))","v":"Movement Skills"},null,"Performing Scripted Plays",{"$f":"IF(COUNTIF('Ext Cert'!$E$20:$E$83,CC3)>=1,\"\",ROW())","v":3},{"$f":"IF(ROW(CC3)-ROW(CC$2)+1>COUNT(CD$2:CD$50),\"\",INDEX(CC:CC,SMALL(CD$2:CD$50,1+ROW(CC3)-ROW(CC$2))))","v":"Performing Scripted Plays"},null,"Design Planning for Performance",{"$f":"IF(COUNTIF('Ext Cert'!$E$20:$E$83,CG3)>=1,\"\",ROW())","v":3},{"$f":"IF(ROW(CG3)-ROW(CG$2)+1>COUNT(CH$2:CH$50),\"\",INDEX(CG:CG,SMALL(CH$2:CH$50,1+ROW(CG3)-ROW(CG$2))))","v":"Design Planning for Performance"},null,"Devising Performance Work",{"$f":"IF(COUNTIF('Ext Cert'!$E$20:$E$83,CK3)>=1,\"\",ROW())","v":3},{"$f":"IF(ROW(CK3)-ROW(CK$2)+1>COUNT(CL$2:CL$50),\"\",INDEX(CK:CK,SMALL(CL$2:CL$50,1+ROW(CK3)-ROW(CK$2))))","v":"Devising Performance Work"},null,"Public Services and Community Protection",{"$f":"IF(COUNTIF('Ext Cert'!$E$20:$E$83,CO3)>=1,\"\",ROW())","v":3},{"$f":"IF(ROW(CO3)-ROW(CO$2)+1>COUNT(CP$2:CP$50),\"\",INDEX(CO:CO,SMALL(CP$2:CP$50,1+ROW(CO3)-ROW(CO$2))))","v":"Public Services and Community Protection"},null,"The Sports Performer in Action",{"$f":"IF(COUNTIF('Ext Cert'!$E$20:$E$83,CS3)>=1,\"\",ROW())","v":3},{"$f":"IF(ROW(CS3)-ROW(CS$2)+1>COUNT(CT$2:CT$50),\"\",INDEX(CS:CS,SMALL(CT$2:CT$50,1+ROW(CS3)-ROW(CS$2))))","v":"The Sports Performer in Action"},null,"Factors Affecting Worldwide Travel and Tourism",{"$f":"IF(COUNTIF('Ext Cert'!$E$20:$E$83,CW3)>=1,\"\",ROW())","v":3},{"$f":"IF(ROW(CW3)-ROW(CW$2)+1>COUNT(CX$2:CX$50),\"\",INDEX(CW:CW,SMALL(CX$2:CX$50,1+ROW(CW3)-ROW(CW$2))))","v":"Factors Affecting Worldwide Travel and Tourism"},null,"Digital Audio Production",{"$f":"IF(COUNTIF('Ext Cert'!$E$20:$E$83,DA3)>=1,\"\",ROW())","v":3},{"$f":"IF(ROW(DA3)-ROW(DA$2)+1>COUNT(DB$2:DB$50),\"\",INDEX(DA:DA,SMALL(DB$2:DB$50,1+ROW(DA3)-ROW(DA$2))))","v":"Digital Audio Production"},null,"Digital Photography for a Media Product",{"$f":"IF(COUNTIF('Ext Cert'!$E$20:$E$83,DE3)>=1,\"\",ROW())","v":3},{"$f":"IF(ROW(DE3)-ROW(DE$2)+1>COUNT(DF$2:DF$50),\"\",INDEX(DE:DE,SMALL(DF$2:DF$50,1+ROW(DE3)-ROW(DE$2))))","v":"Digital Photography for a Media Product"}]
["How Scientific Theories are Formulated",{"$f":"IF(COUNTIF('Ext Cert'!$E$20:$E$83,A4)>=1,\"\",ROW())","v":4},"How Scientific Theories are Formulated",null,"Developing an Art and Design Portfolio",{"$f":"IF(COUNTIF('Ext Cert'!$E$20:$E$83,E4)>=1,\"\",ROW())","v":4},"Developing an Art and Design Portfolio",null,"Fashion Briefs",{"$f":"IF(COUNTIF('Ext Cert'!$E$20:$E$83,I4)>=1,\"\",ROW())","v":4},"Fashion Briefs",null,"Design Crafts Briefs",{"$f":"IF(COUNTIF('Ext Cert'!$E$20:$E$83,M4)>=1,\"\",ROW())","v":4},"Design Crafts Briefs",null,"Developing an Art and Design Portfolio",{"$f":"IF(COUNTIF('Ext Cert'!$E$20:$E$83,Q4)>=1,\"\",ROW())","v":4},"Developing an Art and Design Portfolio",null,"Developing an Art and Design Portfolio",{"$f":"IF(COUNTIF('Ext Cert'!$E$20:$E$83,U4)>=1,\"\",ROW())","v":4},"Developing an Art and Design Portfolio",null,"Design Crafts Briefs",{"$f":"IF(COUNTIF('Ext Cert'!$E$20:$E$83,Y4)>=1,\"\",ROW())","v":4},"Design Crafts Briefs",null,"Using Mobile Devices in Art and Design",{"$f":"IF(COUNTIF('Ext Cert'!$E$20:$E$83,AC4)>=1,\"\",ROW())","v":4},"Using Mobile Devices in Art and Design",null,"Sales and Personal Selling",{"$f":"IF(COUNTIF('Ext Cert'!$E$20:$E$83,AG4)>=1,\"\",ROW())","v":4},"Sales and Personal Selling",null,"Exploring Carpentry and Joinery Principles and Techniques",{"$f":"IF(COUNTIF('Ext Cert'!$E$20:$E$83,AK4)>=1,\"\",ROW())","v":4},"Exploring Carpentry and Joinery Principles and Techniques",null,"Engineering Materials",{"$f":"IF(COUNTIF('Ext Cert'!$E$20:$E$83,AO4)>=1,\"\",ROW())","v":4},"Engineering Materials",null,"The Impact of Nutrition on Health and Wellbeing",{"$f":"IF(COUNTIF('Ext Cert'!$E$20:$E$83,AS4)>=1,\"\",ROW())","v":4},"The Impact of Nutrition on Health and Wellbeing",null,"Planning, Preparing, Cooking and Finishing Food",{"$f":"IF(COUNTIF('Ext Cert'!$E$20:$E$83,AW4)>=1,\"\",ROW())","v":4},"Planning, Preparing, Cooking and Finishing Food",null,"Creating Digital Graphics",{"$f":"IF(COUNTIF('Ext Cert'!$E$20:$E$83,BA4)>=1,\"\",ROW())","v":4},"Creating Digital Graphics",null,"Introducing Music Performance",{"$f":"IF(COUNTIF('Ext Cert'!$E$20:$E$83,BE4)>=1,\"\",ROW())","v":4},"Introducing Music Performance",null,"Musical Theatre Skills",{"$f":"IF(COUNTIF('Ext Cert'!$E$20:$E$83,BI4)>=1,\"\",ROW())","v":4},"Musical Theatre Skills",null,"Devising Performance Work",{"$f":"IF(COUNTIF('Ext Cert'!$E$20:$E$83,BM4)>=1,\"\",ROW())","v":4},"Devising Performance Work",null,"Devising Performance Work",{"$f":"IF(COUNTIF('Ext Cert'!$E$20:$E$83,BQ4)>=1,\"\",ROW())","v":4},"Devising Performance Work",null,"Jazz Dance Techniques",{"$f":"IF(COUNTIF('Ext Cert'!$E$20:$E$83,BU4)>=1,\"\",ROW())","v":4},"Jazz Dance Techniques",null,"Devising Performance Work",{"$f":"IF(COUNTIF('Ext Cert'!$E$20:$E$83,BY4)>=1,\"\",ROW())","v":4},"Devising Performance Work",null,"Design Planning for Performance",{"$f":"IF(COUNTIF('Ext Cert'!$E$20:$E$83,CC4)>=1,\"\",ROW())","v":4},"Design Planning for Performance",null,"Realising Costume Design for Performance",{"$f":"IF(COUNTIF('Ext Cert'!$E$20:$E$83,CG4)>=1,\"\",ROW())","v":4},"Realising Costume Design for Performance",null,"Exploring Improvisation",{"$f":"IF(COUNTIF('Ext Cert'!$E$20:$E$83,CK4)>=1,\"\",ROW())","v":4},"Exploring Improvisation",null,"Health, Fitness and Lifestyle for the Public Services",{"$f":"IF(COUNTIF('Ext Cert'!$E$20:$E$83,CO4)>=1,\"\",ROW())","v":4},"Health, Fitness and Lifestyle for the Public Services",null,"Training for Personal Fitness",{"$f":"IF(COUNTIF('Ext Cert'!$E$20:$E$83,CS4)>=1,\"\",ROW())","v":4},"Training for Personal Fitness",null,"The Travel and Tourism Customer Experience",{"$f":"IF(OR(COUNTIF('Ext Cert'!$E$20:$E$83,CW4)>=1,COUNTIF('Ext Cert'!$E$20:$E$83,CW8)>=1),\"\",ROW())","v":4},"The Travel and Tourism Customer Experience",null,"Digital Publishing Production",{"$f":"IF(COUNTIF('Ext Cert'!$E$20:$E$83,DA4)>=1,\"\",ROW())","v":4},"Digital Publishing Production",null,"Animation for Digital Media",{"$f":"IF(COUNTIF('Ext Cert'!$E$20:$E$83,DE4)>=1,\"\",ROW())","v":4},"Animation for Digital Media"]
["The Living Body",{"$f":"IF(COUNTIF('Ext Cert'!$E$20:$E$83,A5)>=1,\"\",ROW())","v":5},"The Living Body",null,"Using Mobile Devices in Art and Design",{"$f":"IF(COUNTIF('Ext Cert'!$E$20:$E$83,E5)>=1,\"\",ROW())","v":5},"Using Mobile Devices in Art and Design",null,"Textiles Briefs",{"$f":"IF(COUNTIF('Ext Cert'!$E$20:$E$83,I5)>=1,\"\",ROW())","v":5},"Textiles Briefs",null,"Photography Briefs",{"$f":"IF(COUNTIF('Ext Cert'!$E$20:$E$83,M5)>=1,\"\",ROW())","v":5},"Photography Briefs",null,"Using Mobile Devices in Art and Design",{"$f":"IF(COUNTIF('Ext Cert'!$E$20:$E$83,Q5)>=1,\"\",ROW())","v":5},"Using Mobile Devices in Art and Design",null,"Using Mobile Devices in Art and Design",{"$f":"IF(COUNTIF('Ext Cert'!$E$20:$E$83,U5)>=1,\"\",ROW())","v":5},"Using Mobile Devices in Art and Design",null,"Fashion Briefs",{"$f":"IF(COUNTIF('Ext Cert'!$E$20:$E$83,Y5)>=1,\"\",ROW())","v":5},"Fashion Briefs",null,"Fashion Briefs",{"$f":"IF(COUNTIF('Ext Cert'!$E$20:$E$83,AC5)>=1,\"\",ROW())","v":5},"Fashion Briefs",null,"Introducing Retail Business",{"$f":"IF(COUNTIF('Ext Cert'!$E$20:$E$83,AG5)>=1,\"\",ROW())","v":5},"Introducing Retail Business",null,"Exploring Brickwork and Blockwork Principles and Techniques",{"$f":"IF(COUNTIF('Ext Cert'!$E$20:$E$83,AK5)>=1,\"\",ROW())","v":5},"Exploring Brickwork and Blockwork Principles and Techniques",null,"Computer-aided Engineering",{"$f":"IF(COUNTIF('Ext Cert'!$E$20:$E$83,AO5)>=1,\"\",ROW())","v":5},"Computer-aided Engineering",null,"Equality and Diversity in Health and Social Care",{"$f":"IF(COUNTIF('Ext Cert'!$E$20:$E$83,AS5)>=1,\"\",ROW())","v":5},"Equality and Diversity in Health and Social Care",null,"Food and Beverage Service in the Hospitality Industry",{"$f":"IF(COUNTIF('Ext Cert'!$E$20:$E$83,AW5)>=1,\"\",ROW())","v":5},"Food and Beverage Service in the Hospitality Industry",null,"Creating Digital Video",{"$f":"IF(COUNTIF('Ext Cert'!$E$20:$E$83,BA5)>=1,\"\",ROW())","v":5},"Creating Digital Video",null,"Introducing Music Recording",{"$f":"IF(COUNTIF('Ext Cert'!$E$20:$E$83,BE5)>=1,\"\",ROW())","v":5},"Introducing Music Recording",null,"Music Performance Skills",{"$f":"IF(COUNTIF('Ext Cert'!$E$20:$E$83,BI5)>=1,\"\",ROW())","v":5},"Music Performance Skills",null,"Exploring Improvisation",{"$f":"IF(COUNTIF('Ext Cert'!$E$20:$E$83,BM5)>=1,\"\",ROW())","v":5},"Exploring Improvisation",null,"Exploring Improvisation",{"$f":"IF(COUNTIF('Ext Cert'!$E$20:$E$83,BQ5)>=1,\"\",ROW())","v":5},"Exploring Improvisation",null,"Design Planning for Performance",{"$f":"IF(COUNTIF('Ext Cert'!$E$20:$E$83,BU5)>=1,\"\",ROW())","v":5},"Design Planning for Performance",null,"Exploring Improvisation",{"$f":"IF(COUNTIF('Ext Cert'!$E$20:$E$83,BY5)>=1,\"\",ROW())","v":5},"Exploring Improvisation",null,"Realising Costume Design for Performance",{"$f":"IF(COUNTIF('Ext Cert'!$E$20:$E$83,CC5)>=1,\"\",ROW())","v":5},"Realising Costume Design for Performance",null,"Realising Set Design for Performance",{"$f":"IF(COUNTIF('Ext Cert'!$E$20:$E$83,CG5)>=1,\"\",ROW())","v":5},"Realising Set Design for Performance",null,"Multimedia Performance",{"$f":"IF(COUNTIF('Ext Cert'!$E$20:$E$83,CK5)>=1,\"\",ROW())","v":5},"Multimedia Performance",null,"Promotion of Public Services Provision",{"$f":"IF(COUNTIF('Ext Cert'!$E$20:$E$83,CO5)>=1,\"\",ROW())","v":5},"Promotion of Public Services Provision",null,"Leading Sports Activities",{"$f":"IF(COUNTIF('Ext Cert'!$E$20:$E$83,CS5)>=1,\"\",ROW())","v":5},"Leading Sports Activities",null,"Promotion and Sales in Travel and Tourism",{"$f":"IF(COUNTIF('Ext Cert'!$E$20:$E$83,CW5)>=1,\"\",ROW())","v":5},"Promotion and Sales in Travel and Tourism",null,"Website Production",{"$f":"IF(COUNTIF('Ext Cert'!$E$20:$E$83,DA5)>=1,\"\",ROW())","v":5},"Website Production",null,"Digital Audio Editing",{"$f":"IF(COUNTIF('Ext Cert'!$E$20:$E$83,DE5)>=1,\"\",ROW())","v":5},"Digital Audio Editing"]
["Monitoring the Environment",{"$f":"IF(COUNTIF('Ext Cert'!$E$20:$E$83,A6)>=1,\"\",ROW())","v":6},"Monitoring the Environment",null,"Design Crafts Briefs",{"$f":"IF(OR(COUNTIF('Ext Cert'!$E$20:$E$83,E6)>=1,COUNTIF('Ext Cert'!$E$20:$E$83,E3)>=1),\"\",ROW())","v":6},"Design Crafts Briefs",null,"Designing for the Future",{"$f":"IF(COUNTIF('Ext Cert'!$E$20:$E$83,I6)>=1,\"\",ROW())","v":6},"Designing for the Future",null,"Designing for the Future",{"$f":"IF(COUNTIF('Ext Cert'!$E$20:$E$83,M6)>=1,\"\",ROW())","v":6},"Designing for the Future",null,"Fashion Briefs",{"$f":"IF(COUNTIF('Ext Cert'!$E$20:$E$83,Q6)>=1,\"\",ROW())","v":6},"Fashion Briefs",null,"Fashion Briefs",{"$f":"IF(COUNTIF('Ext Cert'!$E$20:$E$83,U6)>=1,\"\",ROW())","v":6},"Fashion Briefs",null,"Graphic Design Briefs",{"$f":"IF(COUNTIF('Ext Cert'!$E$20:$E$83,Y6)>=1,\"\",ROW())","v":6},"Graphic Design Briefs",null,"Visual Arts Briefs",{"$f":"IF(OR(COUNTIF('Ext Cert'!$E$20:$E$83,AC6)>=1,COUNTIF('Ext Cert'!$E$20:$E$83,AC2)>=1),\"\",ROW())","v":6},"Visual Arts Briefs",null,"Providing Business Support",{"$f":"IF(COUNTIF('Ext Cert'!$E$20:$E$83,AG6)>=1,\"\",ROW())","v":6},"Providing Business Support",null,"Exploring Painting and Decorating Principles and Techniques",{"$f":"IF(COUNTIF('Ext Cert'!$E$20:$E$83,AK6)>=1,\"\",ROW())","v":6},"Exploring Painting and Decorating Principles and Techniques",null,"Machining Techniques",{"$f":"IF(COUNTIF('Ext Cert'!$E$20:$E$83,AO6)>=1,\"\",ROW())","v":6},"Machining Techniques",null,"Individual Rights in Health and Social Care",{"$f":"IF(COUNTIF('Ext Cert'!$E$20:$E$83,AS6)>=1,\"\",ROW())","v":6},"Individual Rights in Health and Social Care",null,"Front Office Services in the Hospitality Industry",{"$f":"IF(COUNTIF('Ext Cert'!$E$20:$E$83,AW6)>=1,\"\",ROW())","v":6},"Front Office Services in the Hospitality Industry",null,"Mobile Apps Development",{"$f":"IF(COUNTIF('Ext Cert'!$E$20:$E$83,BA6)>=1,\"\",ROW())","v":6},"Mobile Apps Development",null,"Introducing Music Sequencing",{"$f":"IF(COUNTIF('Ext Cert'!$E$20:$E$83,BE6)>=1,\"\",ROW())","v":6},"Introducing Music Sequencing",null,"Production Skills for Performance",{"$f":"IF(COUNTIF('Ext Cert'!$E$20:$E$83,BI6)>=1,\"\",ROW())","v":6},"Production Skills for Performance",null,"Multimedia Performance",{"$f":"IF(COUNTIF('Ext Cert'!$E$20:$E$83,BM6)>=1,\"\",ROW())","v":6},"Multimedia Performance",null,"Multimedia Performance",{"$f":"IF(COUNTIF('Ext Cert'!$E$20:$E$83,BQ6)>=1,\"\",ROW())","v":6},"Multimedia Performance",null,"Realising Costume Design for Performance",{"$f":"IF(COUNTIF('Ext Cert'!$E$20:$E$83,BU6)>=1,\"\",ROW())","v":6},"Realising Costume Design for Performance",null,"Multimedia Performance",{"$f":"IF(COUNTIF('Ext Cert'!$E$20:$E$83,BY6)>=1,\"\",ROW())","v":6},"Multimedia Performance",null,"Realising Set Design for Performance",{"$f":"IF(COUNTIF('Ext Cert'!$E$20:$E$83,CC6)>=1,\"\",ROW())","v":6},"Realising Set Design for Performance",null,"Realising Prop Design for Performance",{"$f":"IF(COUNTIF('Ext Cert'!$E$20:$E$83,CG6)>=1,\"\",ROW())","v":6},"Realising Prop Design for Performance",null,"Voice and Speech for Performers",{"$f":"IF(COUNTIF('Ext Cert'!$E$20:$E$83,CK6)>=1,\"\",ROW())","v":6},"Voice and Speech for Performers",null,"Community and Cultural Awareness",{"$f":"IF(COUNTIF('Ext Cert'!$E$20:$E$83,CO6)>=1,\"\",ROW())","v":6},"Community and Cultural Awareness",null,"Promotion and Sponsorship in Sport",{"$f":"IF(COUNTIF('Ext Cert'!$E$20:$E$83,CS6)>=1,\"\",ROW())","v":6},"Promotion and Sponsorship in Sport",null,"Travel and Tourism Employment Opportunities",{"$f":"IF(COUNTIF('Ext Cert'!$E$20:$E$83,CW6)>=1,\"\",ROW())","v":6},"Travel and Tourism Employment Opportunities",null,"Digital Games Production",{"$f":"IF(COUNTIF('Ext Cert'!$E$20:$E$83,DA6)>=1,\"\",ROW())","v":6},"Digital Games Production",null,"Graphic Design for Digital Media",{"$f":"IF(COUNTIF('Ext Cert'!$E$20:$E$83,DE6)>=1,\"\",ROW())","v":6},"Graphic Design for Digital Media"]
["Growing Plants for Food",{"$f":"IF(COUNTIF('Ext Cert'!$E$20:$E$83,A7)>=1,\"\",ROW())","v":7},"Growing Plants for Food",null,"Fashion Briefs",{"$f":"IF(COUNTIF('Ext Cert'!$E$20:$E$83,E7)>=1,\"\",ROW())","v":7},"Fashion Briefs",null,"Applying Contextual References in Art and Design",{"$f":"IF(COUNTIF('Ext Cert'!$E$20:$E$83,I7)>=1,\"\",ROW())","v":7},"Applying Contextual References in Art and Design",null,"Applying Contextual References in Art and Design",{"$f":"IF(COUNTIF('Ext Cert'!$E$20:$E$83,M7)>=1,\"\",ROW())","v":7},"Applying Contextual References in Art and Design",null,"Designing for the Future",{"$f":"IF(COUNTIF('Ext Cert'!$E$20:$E$83,Q7)>=1,\"\",ROW())","v":7},"Designing for the Future",null,"Graphic Design Briefs",{"$f":"IF(OR(COUNTIF('Ext Cert'!$E$20:$E$83,U7)>=1,COUNTIF('Ext Cert'!$E$20:$E$83,U2)>=1),\"\",ROW())","v":7},"Graphic Design Briefs",null,"Textiles Briefs",{"$f":"IF(COUNTIF('Ext Cert'!$E$20:$E$83,Y7)>=1,\"\",ROW())","v":7},"Textiles Briefs",null,"Photography Briefs",{"$f":"IF(COUNTIF('Ext Cert'!$E$20:$E$83,AC7)>=1,\"\",ROW())","v":7},"Photography Briefs",null,"Recruitment, Selection and Employment",{"$f":"IF(OR(COUNTIF('Ext Cert'!$E$20:$E$83,AG7)>=1,COUNTIF('Ext Cert'!$E$20:$E$83,AG22)>=1),\"\",ROW())","v":7},"Recruitment, Selection and Employment",null,"Exploring Plumbing Principles and Techniques",{"$f":"IF(COUNTIF('Ext Cert'!$E$20:$E$83,AK7)>=1,\"\",ROW())","v":7},"Construction Processes and Operations",null,"Electronic Circuit Design and Construction",{"$f":"IF(COUNTIF('Ext Cert'!$E$20:$E$83,AO7)>=1,\"\",ROW())","v":7},"Electronic Circuit Design and Construction",null,"Human Body Systems and Care of Disorders",{"$f":"IF(COUNTIF('Ext Cert'!$E$20:$E$83,AS7)>=1,\"\",ROW())","v":7},"Human Body Systems and Care of Disorders",null,"Marketing and Promotion in Hospitality",{"$f":"IF(COUNTIF('Ext Cert'!$E$20:$E$83,AW7)>=1,\"\",ROW())","v":7},"Marketing and Promotion in Hospitality",null,"Spreadsheet Development",{"$f":"IF(COUNTIF('Ext Cert'!$E$20:$E$83,BA7)>=1,\"\",ROW())","v":7},"Spreadsheet Development",null,"Introducing Choral Studies",{"$f":"IF(COUNTIF('Ext Cert'!$E$20:$E$83,BE7)>=1,\"\",ROW())","v":7},"Introducing Choral Studies",null,null,null,null,null,"Voice and Speech for Performers",{"$f":"IF(COUNTIF('Ext Cert'!$E$20:$E$83,BM7)>=1,\"\",ROW())","v":7},"Voice and Speech for Performers",null,"Voice and Speech for Performers",{"$f":"IF(COUNTIF('Ext Cert'!$E$20:$E$83,BQ7)>=1,\"\",ROW())","v":7},"Voice and Speech for Performers",null,"Realising Set Design for Performance",{"$f":"IF(COUNTIF('Ext Cert'!$E$20:$E$83,BU7)>=1,\"\",ROW())","v":7},"Realising Set Design for Performance",null,"Contemporary Dance Techniques",{"$f":"IF(COUNTIF('Ext Cert'!$E$20:$E$83,BY7)>=1,\"\",ROW())","v":7},"Contemporary Dance Techniques",null,"Realising Prop Design for Performance",{"$f":"IF(COUNTIF('Ext Cert'!$E$20:$E$83,CC7)>=1,\"\",ROW())","v":7},"Realising Prop Design for Performance",null,"Realising Mask Design for Performance",{"$f":"IF(COUNTIF('Ext Cert'!$E$20:$E$83,CG7)>=1,\"\",ROW())","v":7},"Realising Mask Design for Performance",null,"Performing Scripted Plays",{"$f":"IF(COUNTIF('Ext Cert'!$E$20:$E$83,CK7)>=1,\"\",ROW())","v":7},"Performing Scripted Plays",null,"Adventurous Activities in the Public Services",{"$f":"IF(OR(COUNTIF('Ext Cert'!$E$20:$E$83,CO7)>=1,COUNTIF('Ext Cert'!$E$20:$E$83,CO11)>=1),\"\",ROW())","v":7},"Adventurous Activities in the Public Services",null,"Lifestyle and Well-being",{"$f":"IF(COUNTIF('Ext Cert'!$E$20:$E$83,CS7)>=1,\"\",ROW())","v":7},"Lifestyle and Well-being",null,"Organising a Travel and Tourism Study Visit",{"$f":"IF(COUNTIF('Ext Cert'!$E$20:$E$83,CW7)>=1,\"\",ROW())","v":7},"Organising a Travel and Tourism Study Visit",null,null,null,null,null,"Writing for Digital Media",{"$f":"IF(COUNTIF('Ext Cert'!$E$20:$E$83,DE7)>=1,\"\",ROW())","v":7},"Writing for Digital Media"]
["Investigating a Crime Scene",{"$f":"IF(COUNTIF('Ext Cert'!$E$20:$E$83,A8)>=1,\"\",ROW())","v":8},"Investigating a Crime Scene",null,"Graphic Design Briefs",{"$f":"IF(OR(COUNTIF('Ext Cert'!$E$20:$E$83,E8)>=1,COUNTIF('Ext Cert'!$E$20:$E$83,E2)>=1),\"\",ROW())","v":8},"Graphic Design Briefs",null,"Art, Craft and Design in the Creative Industries",{"$f":"IF(COUNTIF('Ext Cert'!$E$20:$E$83,I8)>=1,\"\",ROW())","v":8},"Art, Craft and Design in the Creative Industries",null,"Art, Craft and Design in the Creative Industries",{"$f":"IF(COUNTIF('Ext Cert'!$E$20:$E$83,M8)>=1,\"\",ROW())","v":8},"Art, Craft and Design in the Creative Industries",null,"Applying Contextual References in Art and Design",{"$f":"IF(COUNTIF('Ext Cert'!$E$20:$E$83,Q8)>=1,\"\",ROW())","v":8},"Applying Contextual References in Art and Design",null,"Textiles Briefs",{"$f":"IF(COUNTIF('Ext Cert'!$E$20:$E$83,U8)>=1,\"\",ROW())","v":8},"Textiles Briefs",null,"Photography Briefs",{"$f":"IF(COUNTIF('Ext Cert'!$E$20:$E$83,Y8)>=1,\"\",ROW())","v":8},"Photography Briefs",null,"Designing for the Future",{"$f":"IF(COUNTIF('Ext Cert'!$E$20:$E$83,AC8)>=1,\"\",ROW())","v":8},"Designing for the Future",null,"Using Business Documentation",{"$f":"IF(COUNTIF('Ext Cert'!$E$20:$E$83,AG8)>=1,\"\",ROW())","v":8},"Using Business Documentation",null,"Exploring Electrical Principles and Techniques",{"$f":"IF(COUNTIF('Ext Cert'!$E$20:$E$83,AK8)>=1,\"\",ROW())","v":8},"Construction Drawing Techniques",null,"Electrical and Mechanical Science for Engineering",{"$f":"IF(COUNTIF('Ext Cert'!$E$20:$E$83,AO8)>=1,\"\",ROW())","v":8},"Electrical and Mechanical Science for Engineering",null,"Services in Health and Social Care",{"$f":"IF(COUNTIF('Ext Cert'!$E$20:$E$83,AS8)>=1,\"\",ROW())","v":8},"Services in Health and Social Care",null,"Accommodation Services in the Hospitality Industry",{"$f":"IF(COUNTIF('Ext Cert'!$E$20:$E$83,AW8)>=1,\"\",ROW())","v":8},"Accommodation Services in the Hospitality Industry",null,"Database Development",{"$f":"IF(COUNTIF('Ext Cert'!$E$20:$E$83,BA8)>=1,\"\",ROW())","v":8},"Database Development",null,"Introducing Music Theory",{"$f":"IF(COUNTIF('Ext Cert'!$E$20:$E$83,BE8)>=1,\"\",ROW())","v":8},"Introducing Music Theory",null,null,null,null,null,"Performing Scripted Plays",{"$f":"IF(COUNTIF('Ext Cert'!$E$20:$E$83,BM8)>=1,\"\",ROW())","v":8},"Performing Scripted Plays",null,"Performing Scripted Plays",{"$f":"IF(COUNTIF('Ext Cert'!$E$20:$E$83,BQ8)>=1,\"\",ROW())","v":8},"Performing Scripted Plays",null,"Realising Prop Design for Performance",{"$f":"IF(COUNTIF('Ext Cert'!$E$20:$E$83,BU8)>=1,\"\",ROW())","v":8},"Realising Prop Design for Performance",null,"Exploring Urban Dance Styles",{"$f":"IF(COUNTIF('Ext Cert'!$E$20:$E$83,BY8)>=1,\"\",ROW())","v":8},"Exploring Urban Dance Styles",null,"Realising Mask Design for Performance",{"$f":"IF(COUNTIF('Ext Cert'!$E$20:$E$83,CC8)>=1,\"\",ROW())","v":8},"Realising Mask Design for Performance",null,"Lighting for Performance",{"$f":"IF(COUNTIF('Ext Cert'!$E$20:$E$83,CG8)>=1,\"\",ROW())","v":8},"Lighting for Performance",null,"Contemporary Dance Techniques",{"$f":"IF(COUNTIF('Ext Cert'!$E$20:$E$83,CK8)>=1,\"\",ROW())","v":8},"Contemporary Dance Techniques",null,"Sport and Recreation in the Public Services",{"$f":"IF(COUNTIF('Ext Cert'!$E$20:$E$83,CO8)>=1,\"\",ROW())","v":8},"Sport and Recreation in the Public Services",null,"Injury and the Sports Performer",{"$f":"IF(COUNTIF('Ext Cert'!$E$20:$E$83,CS8)>=1,\"\",ROW())","v":8},"Injury and the Sports Performer",null,"Delivering the Travel and Tourism Customer Experience",{"$f":"IF(OR(COUNTIF('Ext Cert'!$E$20:$E$83,CW8)>=1,COUNTIF('Ext Cert'!$E$20:$E$83,CW4)>=1),\"\",ROW())","v":8},"Delivering the Travel and Tourism Customer Experience",null,null,null,null,null,"Digital Games Testing",{"$f":"IF(COUNTIF('Ext Cert'!$E$20:$E$83,DE8)>=1,\"\",ROW())","v":8},"Digital Games Testing"]
["Science in Medicine",{"$f":"IF(COUNTIF('Ext Cert'!$E$20:$E$83,A9)>=1,\"\",ROW())","v":9},"Science in Medicine",null,"Textiles Briefs",{"$f":"IF(COUNTIF('Ext Cert'!$E$20:$E$83,E9)>=1,\"\",ROW())","v":9},"Textiles Briefs",null,"Painting Briefs",{"$f":"IF(OR(COUNTIF('Ext Cert'!$E$20:$E$83,I9)>=1,COUNTIF('Ext Cert'!$E$20:$E$83,I2)>=1),\"\",ROW())","v":9},"Painting Briefs",null,"Designing Products",{"$f":"IF(COUNTIF('Ext Cert'!$E$20:$E$83,M9)>=1,\"\",ROW())","v":9},"Designing Products",null,"Art, Craft and Design in the Creative Industries",{"$f":"IF(COUNTIF('Ext Cert'!$E$20:$E$83,Q9)>=1,\"\",ROW())","v":9},"Art, Craft and Design in the Creative Industries",null,"Applying Contextual References in Art and Design",{"$f":"IF(COUNTIF('Ext Cert'!$E$20:$E$83,U9)>=1,\"\",ROW())","v":9},"Applying Contextual References in Art and Design",null,"Applying Contextual References in Art and Design",{"$f":"IF(COUNTIF('Ext Cert'!$E$20:$E$83,Y9)>=1,\"\",ROW())","v":9},"Applying Contextual References in Art and Design",null,"Applying Contextual References in Art and Design",{"$f":"IF(COUNTIF('Ext Cert'!$E$20:$E$83,AC9)>=1,\"\",ROW())","v":9},"Applying Contextual References in Art and Design",null,"Building Successful Business Teams",{"$f":"IF(COUNTIF('Ext Cert'!$E$20:$E$83,AG9)>=1,\"\",ROW())","v":9},"Building Successful Business Teams",null,"Sustainability in Construction",{"$f":"IF(COUNTIF('Ext Cert'!$E$20:$E$83,AK9)>=1,\"\",ROW())","v":9},"Exploring Carpentry and Joinery Principles and Techniques",null,"Engineering Design",{"$f":"IF(COUNTIF('Ext Cert'!$E$20:$E$83,AO9)>=1,\"\",ROW())","v":9},"Engineering Design",null,"Creative and Therapeutic Activities in Health and Social Care",{"$f":"IF(COUNTIF('Ext Cert'!$E$20:$E$83,AS9)>=1,\"\",ROW())","v":9},"Creative and Therapeutic Activities in Health and Social Care",null,"Planning and Running a Hospitality Event",{"$f":"IF(COUNTIF('Ext Cert'!$E$20:$E$83,AW9)>=1,\"\",ROW())","v":9},"Planning and Running a Hospitality Event",null,"Computer Networks",{"$f":"IF(COUNTIF('Ext Cert'!$E$20:$E$83,BA9)>=1,\"\",ROW())","v":9},"Computer Networks",null,"Developing Solo Music Performance",{"$f":"IF(COUNTIF('Ext Cert'!$E$20:$E$83,BE9)>=1,\"\",ROW())","v":9},"Developing Solo Music Performance",null,null,null,null,null,"Contemporary Dance Techniques",{"$f":"IF(COUNTIF('Ext Cert'!$E$20:$E$83,BM9)>=1,\"\",ROW())","v":9},"Contemporary Dance Techniques",null,"Community Arts",{"$f":"IF(COUNTIF('Ext Cert'!$E$20:$E$83,BQ9)>=1,\"\",ROW())","v":9},"Community Arts",null,"Realising Mask Design for Performance",{"$f":"IF(COUNTIF('Ext Cert'!$E$20:$E$83,BU9)>=1,\"\",ROW())","v":9},"Realising Mask Design for Performance",null,"Jazz Dance Techniques",{"$f":"IF(COUNTIF('Ext Cert'!$E$20:$E$83,BY9)>=1,\"\",ROW())","v":9},"Jazz Dance Techniques",null,"Lighting for Performance",{"$f":"IF(COUNTIF('Ext Cert'!$E$20:$E$83,CC9)>=1,\"\",ROW())","v":9},"Lighting for Performance",null,"Sound for Performance",{"$f":"IF(COUNTIF('Ext Cert'!$E$20:$E$83,CG9)>=1,\"\",ROW())","v":9},"Sound for Performance",null,"Exploring Urban Dance Styles",{"$f":"IF(COUNTIF('Ext Cert'!$E$20:$E$83,CK9)>=1,\"\",ROW())","v":9},"Exploring Urban Dance Styles",null,"Land Navigation by Map and Compass",{"$f":"IF(COUNTIF('Ext Cert'!$E$20:$E$83,CO9)>=1,\"\",ROW())","v":9},"Land Navigation by Map and Compass",null,"Running a Sports Event",{"$f":"IF(COUNTIF('Ext Cert'!$E$20:$E$83,CS9)>=1,\"\",ROW())","v":9},"Running a Sports Event",null,"Marketing in Travel and Tourism",{"$f":"IF(COUNTIF('Ext Cert'!$E$20:$E$83,CW9)>=1,\"\",ROW())","v":9},"Marketing in Travel and Tourism",null,null,null,null,null,"Digital Art for a Media Product",{"$f":"IF(COUNTIF('Ext Cert'!$E$20:$E$83,DE9)>=1,\"\",ROW())","v":9},"Digital Art for a Media Product"]
["Understanding Human Behaviour",{"$f":"IF(COUNTIF('Ext Cert'!$E$20:$E$83,A10)>=1,\"\",ROW())","v":10},"Understanding Human Behaviour",null,"Visual Arts Briefs",{"$f":"IF(OR(COUNTIF('Ext Cert'!$E$20:$E$83,E10)>=1,COUNTIF('Ext Cert'!$E$20:$E$83,E2)>=1,COUNTIF('Ext Cert'!$E$20:$E$83,E3)>=1),\"\",ROW())","v":10},"Visual Arts Briefs",null,null,null,null,null,"Fashion Promotion",{"$f":"IF(COUNTIF('Ext Cert'!$E$20:$E$83,M10)>=1,\"\",ROW())","v":10},"Fashion Promotion",null,"Interactive Media Production Briefs",{"$f":"IF(COUNTIF('Ext Cert'!$E$20:$E$83,Q10)>=1,\"\",ROW())","v":10},"Interactive Media Production Briefs",null,"Art, Craft and Design in the Creative Industries",{"$f":"IF(COUNTIF('Ext Cert'!$E$20:$E$83,U10)>=1,\"\",ROW())","v":10},"Art, Craft and Design in the Creative Industries",null,"Art, Craft and Design in the Creative Industries",{"$f":"IF(COUNTIF('Ext Cert'!$E$20:$E$83,Y10)>=1,\"\",ROW())","v":10},"Art, Craft and Design in the Creative Industries",null,"Art, Craft and Design in the Creative Industries",{"$f":"IF(COUNTIF('Ext Cert'!$E$20:$E$83,AC10)>=1,\"\",ROW())","v":10},"Art, Craft and Design in the Creative Industries",null,"Introducing Law and Consumer Rights",{"$f":"IF(COUNTIF('Ext Cert'!$E$20:$E$83,AG10)>=1,\"\",ROW())","v":10},"Introducing Law and Consumer Rights",null,"Exploring Roofing Principles and Techniques",{"$f":"IF(COUNTIF('Ext Cert'!$E$20:$E$83,AK10)>=1,\"\",ROW())","v":10},"Exploring Brickwork and Blockwork Principles and Techniques",null,"Engineering Assembly",{"$f":"IF(COUNTIF('Ext Cert'!$E$20:$E$83,AO10)>=1,\"\",ROW())","v":10},"Engineering Assembly",null,"The Health and Social Care Sector",{"$f":"IF(OR(COUNTIF('Ext Cert'!$E$20:$E$83,AS10)>=1,COUNTIF('Ext Cert'!$E$20:$E$83,AS11)>=1),\"\",ROW())","v":10},"The Health and Social Care Sector",null,"Contemporary World Food Cooking Skills",{"$f":"IF(COUNTIF('Ext Cert'!$E$20:$E$83,AW10)>=1,\"\",ROW())","v":10},"Contemporary World Food Cooking Skills",null,"Software Development",{"$f":"IF(COUNTIF('Ext Cert'!$E$20:$E$83,BA10)>=1,\"\",ROW())","v":10},"Software Development",null,"The Development of Music",{"$f":"IF(COUNTIF('Ext Cert'!$E$20:$E$83,BE10)>=1,\"\",ROW())","v":10},"The Development of Music",null,null,null,null,null,"Exploring Urban Dance Styles",{"$f":"IF(COUNTIF('Ext Cert'!$E$20:$E$83,BM10)>=1,\"\",ROW())","v":10},"Exploring Urban Dance Styles",null,"Directing Performance",{"$f":"IF(COUNTIF('Ext Cert'!$E$20:$E$83,BQ10)>=1,\"\",ROW())","v":10},"Directing Performance",null,"Lighting for Performance",{"$f":"IF(COUNTIF('Ext Cert'!$E$20:$E$83,BU10)>=1,\"\",ROW())","v":10},"Lighting for Performance",null,"Community Arts",{"$f":"IF(COUNTIF('Ext Cert'!$E$20:$E$83,BY10)>=1,\"\",ROW())","v":10},"Community Arts",null,"Sound for Performance",{"$f":"IF(COUNTIF('Ext Cert'!$E$20:$E$83,CC10)>=1,\"\",ROW())","v":10},"Sound for Performance",null,"Supporting Performance: Stage Management",{"$f":"IF(COUNTIF('Ext Cert'!$E$20:$E$83,CG10)>=1,\"\",ROW())","v":10},"Supporting Performance: Stage Management",null,"Jazz Dance Techniques",{"$f":"IF(COUNTIF('Ext Cert'!$E$20:$E$83,CK10)>=1,\"\",ROW())","v":10},"Jazz Dance Techniques",null,"Volunteering for the Public Services",{"$f":"IF(COUNTIF('Ext Cert'!$E$20:$E$83,CO10)>=1,\"\",ROW())","v":10},"Volunteering for the Public Services",null,"The Sport and Active Leisure Industry",{"$f":"IF(COUNTIF('Ext Cert'!$E$20:$E$83,CS10)>=1,\"\",ROW())","v":10},"The Sport and Active Leisure Industry",null,"Airports and Airlines",{"$f":"IF(COUNTIF('Ext Cert'!$E$20:$E$83,CW10)>=1,\"\",ROW())","v":10},"Airports and Airlines",null,null,null,null,null,"Digital Audio Mixing",{"$f":"IF(COUNTIF('Ext Cert'!$E$20:$E$83,DE10)>=1,\"\",ROW())","v":10},"Digital Audio Mixing"]
["Designing and Making Useful Devices in Science",{"$f":"IF(COUNTIF('Ext Cert'!$E$20:$E$83,A11)>=1,\"\",ROW())","v":11},"Designing and Making Useful Devices in Science",null,"Photography Briefs",{"$f":"IF(COUNTIF('Ext Cert'!$E$20:$E$83,E11)>=1,\"\",ROW())","v":11},"Photography Briefs",null,null,null,null,null,"Fashion Retail",{"$f":"IF(COUNTIF('Ext Cert'!$E$20:$E$83,M11)>=1,\"\",ROW())","v":11},"Fashion Retail",null,"Designing Products",{"$f":"IF(OR(COUNTIF('Ext Cert'!$E$20:$E$83,Q11)>=1,COUNTIF('Ext Cert'!$E$20:$E$83,Q3)>=1),\"\",ROW())","v":11},"Designing Products",null,"Digital Art and Design Briefs",{"$f":"IF(COUNTIF('Ext Cert'!$E$20:$E$83,U11)>=1,\"\",ROW())","v":11},"Digital Art and Design Briefs",null,"Interactive Media Production Briefs",{"$f":"IF(COUNTIF('Ext Cert'!$E$20:$E$83,Y11)>=1,\"\",ROW())","v":11},"Interactive Media Production Briefs",null,"Digital Art and Design Briefs",{"$f":"IF(COUNTIF('Ext Cert'!$E$20:$E$83,AC11)>=1,\"\",ROW())","v":11},"Digital Art and Design Briefs",null,"Financial Planning and Forecasting",{"$f":"IF(COUNTIF('Ext Cert'!$E$20:$E$83,AG11)>=1,\"\",ROW())","v":11},"Financial Planning and Forecasting",null,"Exploring Wall and Floor Tiling Principles and Techniques",{"$f":"IF(COUNTIF('Ext Cert'!$E$20:$E$83,AK11)>=1,\"\",ROW())","v":11},"Exploring Painting and Decorating Principles and Techniques",null,"Vehicle Engines and Other Systems",{"$f":"IF(COUNTIF('Ext Cert'!$E$20:$E$83,AO11)>=1,\"\",ROW())","v":11},"Vehicle Engines and Other Systems",null,"The Early Years Sector",{"$f":"IF(OR(COUNTIF('Ext Cert'!$E$20:$E$83,AS11)>=1,COUNTIF('Ext Cert'!$E$20:$E$83,AS10)>=1),\"\",ROW())","v":11},"The Early Years Sector",null,"Menu Planning",{"$f":"IF(COUNTIF('Ext Cert'!$E$20:$E$83,AW11)>=1,\"\",ROW())","v":11},"Menu Planning",null,"Website Development",{"$f":"IF(COUNTIF('Ext Cert'!$E$20:$E$83,BA11)>=1,\"\",ROW())","v":11},"Website Development",null,"Developing Music Composition",{"$f":"IF(COUNTIF('Ext Cert'!$E$20:$E$83,BE11)>=1,\"\",ROW())","v":11},"Developing Music Composition",null,null,null,null,null,"Jazz Dance Techniques",{"$f":"IF(COUNTIF('Ext Cert'!$E$20:$E$83,BM11)>=1,\"\",ROW())","v":11},"Jazz Dance Techniques",null,"Planning and Managing a Performing Arts Event",{"$f":"IF(COUNTIF('Ext Cert'!$E$20:$E$83,BQ11)>=1,\"\",ROW())","v":11},"Planning and Managing a Performing Arts Event",null,"Sound for Performance",{"$f":"IF(COUNTIF('Ext Cert'!$E$20:$E$83,BU11)>=1,\"\",ROW())","v":11},"Sound for Performance",null,"Physical Theatre Performance",{"$f":"IF(COUNTIF('Ext Cert'!$E$20:$E$83,BY11)>=1,\"\",ROW())","v":11},"Physical Theatre Performance",null,"Make-up for Performance",{"$f":"IF(COUNTIF('Ext Cert'!$E$20:$E$83,CC11)>=1,\"\",ROW())","v":11},"Make-up for Performance",null,"Supporting Performance: Front of House",{"$f":"IF(COUNTIF('Ext Cert'!$E$20:$E$83,CG11)>=1,\"\",ROW())","v":11},"Supporting Performance: Front of House",null,null,null,null,null,"Multi-day Expedition Experience",{"$f":"IF(OR(COUNTIF('Ext Cert'!$E$20:$E$83,CO11)>=1,COUNTIF('Ext Cert'!$E$20:$E$83,CO7)>=1),\"\",ROW())","v":11},"Multi-day Expedition Experience",null,"Profiling Sports Performance",{"$f":"IF(COUNTIF('Ext Cert'!$E$20:$E$83,CS11)>=1,\"\",ROW())","v":11},"Profiling Sports Performance",null,"Work-related Experience in Travel and Tourism",{"$f":"IF(COUNTIF('Ext Cert'!$E$20:$E$83,CW11)>=1,\"\",ROW())","v":11},"Work-related Experience in Travel and Tourism",null,null,null,null,null,"Lighting for Moving Image",{"$f":"IF(COUNTIF('Ext Cert'!$E$20:$E$83,DE11)>=1,\"\",ROW())","v":11},"Lighting for Moving Image"]
["Chemical Analysis and Detection",{"$f":"IF(COUNTIF('Ext Cert'!$E$20:$E$83,A12)>=1,\"\",ROW())","v":12},"Chemical Analysis and Detection",null,"Designing for the Future",{"$f":"IF(COUNTIF('Ext Cert'!$E$20:$E$83,E12)>=1,\"\",ROW())","v":12},"Designing for the Future",null,null,null,null,null,"Surface Design",{"$f":"IF(COUNTIF('Ext Cert'!$E$20:$E$83,M12)>=1,\"\",ROW())","v":12},"Surface Design",null,"Studio Photography",{"$f":"IF(COUNTIF('Ext Cert'!$E$20:$E$83,Q12)>=1,\"\",ROW())","v":12},"Studio Photography",null,"Interactive Media Production Briefs",{"$f":"IF(COUNTIF('Ext Cert'!$E$20:$E$83,U12)>=1,\"\",ROW())","v":12},"Interactive Media Production Briefs",null,"Printmaking Briefs",{"$f":"IF(COUNTIF('Ext Cert'!$E$20:$E$83,Y12)>=1,\"\",ROW())","v":12},{"$f":"IF(ROW(Y12)-ROW(Y$2)+1>COUNT(Z$2:Z$50),\"\",INDEX(Y:Y,SMALL(Z$2:Z$50,1+ROW(Y12)-ROW(Y$2))))","v":"Printmaking Briefs"},null,"Painting Briefs",{"$f":"IF(COUNTIF('Ext Cert'!$E$20:$E$83,AC12)>=1,\"\",ROW())","v":12},"Painting Briefs",null,"Business Online",{"$f":"IF(COUNTIF('Ext Cert'!$E$20:$E$83,AG12)>=1,\"\",ROW())","v":12},"Business Online",null,"Exploring Plastering and Dry Lining Principles and Techniques",{"$f":"IF(COUNTIF('Ext Cert'!$E$20:$E$83,AK12)>=1,\"\",ROW())","v":12},"Exploring Plumbing Principles and Techniques",null,"Operating an Efficient Workplace",{"$f":"IF(COUNTIF('Ext Cert'!$E$20:$E$83,AO12)>=1,\"\",ROW())","v":12},"Operating an Efficient Workplace",null,"Carrying out a Research Project in Health and Social Care",{"$f":"IF(COUNTIF('Ext Cert'!$E$20:$E$83,AS12)>=1,\"\",ROW())","v":12},"Carrying out a Research Project in Health and Social Care",null,"Managing Finance in Hospitality",{"$f":"IF(COUNTIF('Ext Cert'!$E$20:$E$83,AW12)>=1,\"\",ROW())","v":12},"Managing Finance in Hospitality",null,"Installing and Maintaining Computer Hardware",{"$f":"IF(COUNTIF('Ext Cert'!$E$20:$E$83,BA12)>=1,\"\",ROW())","v":12},"Installing and Maintaining Computer Hardware",null,"Producing a Music Recording",{"$f":"IF(COUNTIF('Ext Cert'!$E$20:$E$83,BE12)>=1,\"\",ROW())","v":12},"Producing a Music Recording",null,null,null,null,null,"Design Planning for Performance",{"$f":"IF(COUNTIF('Ext Cert'!$E$20:$E$83,BM12)>=1,\"\",ROW())","v":12},"Design Planning for Performance",null,"Physical Theatre Performance",{"$f":"IF(COUNTIF('Ext Cert'!$E$20:$E$83,BQ12)>=1,\"\",ROW())","v":12},"Physical Theatre Performance",null,"Make-up for Performance",{"$f":"IF(COUNTIF('Ext Cert'!$E$20:$E$83,BU12)>=1,\"\",ROW())","v":12},"Make-up for Performance",null,"Variety Performance",{"$f":"IF(COUNTIF('Ext Cert'!$E$20:$E$83,BY12)>=1,\"\",ROW())","v":12},"Variety Performance",null,"Wardrobe for Stage Performance",{"$f":"IF(COUNTIF('Ext Cert'!$E$20:$E$83,CC12)>=1,\"\",ROW())","v":12},"Wardrobe for Stage Performance",null,"Make-up for Performance",{"$f":"IF(COUNTIF('Ext Cert'!$E$20:$E$83,CG12)>=1,\"\",ROW())","v":12},"Make-up for Performance",null,null,null,null,null,"Health and Safety in the Public Services",{"$f":"IF(COUNTIF('Ext Cert'!$E$20:$E$83,CO12)>=1,\"\",ROW())","v":12},"Health and Safety in the Public Services",null,"Carrying Out a Sports-related Project",{"$f":"IF(COUNTIF('Ext Cert'!$E$20:$E$83,CS12)>=1,\"\",ROW())","v":12},"Carrying Out a Sports-related Project",null,"Holiday Representatives",{"$f":"IF(COUNTIF('Ext Cert'!$E$20:$E$83,CW12)>=1,\"\",ROW())","v":12},"Holiday Representatives"]
["Exploring our Universe",{"$f":"IF(COUNTIF('Ext Cert'!$E$20:$E$83,A13)>=1,\"\",ROW())","v":13},"Exploring our Universe",null,"Applying Contextual References in Art and Design",{"$f":"IF(COUNTIF('Ext Cert'!$E$20:$E$83,E13)>=1,\"\",ROW())","v":13},"Applying Contextual References in Art and Design",null,null,null,null,null,null,null,null,null,"Location Photography",{"$f":"IF(COUNTIF('Ext Cert'!$E$20:$E$83,Q13)>=1,\"\",ROW())","v":13},"Location Photography",null,null,null,null,null,"Drawing from Observation",{"$f":"IF(COUNTIF('Ext Cert'!$E$20:$E$83,Y13)>=1,\"\",ROW())","v":13},{"$f":"IF(ROW(Y13)-ROW(Y$2)+1>COUNT(Z$2:Z$50),\"\",INDEX(Y:Y,SMALL(Z$2:Z$50,1+ROW(Y13)-ROW(Y$2))))","v":"Drawing from Observation"},null,"Practical Research Project in Art and Design",{"$f":"IF(COUNTIF('Ext Cert'!$E$20:$E$83,AC13)>=1,\"\",ROW())","v":13},"Practical Research Project in Art and Design",null,"Public Sector Business",{"$f":"IF(COUNTIF('Ext Cert'!$E$20:$E$83,AG13)>=1,\"\",ROW())","v":13},"Public Sector Business",null,"Carpentry and Joinery Operations",{"$f":"IF(COUNTIF('Ext Cert'!$E$20:$E$83,AK13)>=1,\"\",ROW())","v":13},"Exploring Electrical Principles and Techniques",null,"Vehicle Electrical Sytems",{"$f":"IF(COUNTIF('Ext Cert'!$E$20:$E$83,AO13)>=1,\"\",ROW())","v":13},"Vehicle Electrical Sytems",null,"Vocational Experience in Health and Social Care",{"$f":"IF(COUNTIF('Ext Cert'!$E$20:$E$83,AS13)>=1,\"\",ROW())","v":13},"Vocational Experience in Health and Social Care",null,"Alcohol Awareness in Hospitality",{"$f":"IF(COUNTIF('Ext Cert'!$E$20:$E$83,AW13)>=1,\"\",ROW())","v":13},"Alcohol Awareness in Hospitality",null,"Installing and Maintaining Computer Software",{"$f":"IF(COUNTIF('Ext Cert'!$E$20:$E$83,BA13)>=1,\"\",ROW())","v":13},"Installing and Maintaining Computer Software",null,"Music Ensemble",{"$f":"IF(COUNTIF('Ext Cert'!$E$20:$E$83,BE13)>=1,\"\",ROW())","v":13},"Music Ensemble",null,null,null,null,null,"Realising Costume Design for Performance",{"$f":"IF(COUNTIF('Ext Cert'!$E$20:$E$83,BM13)>=1,\"\",ROW())","v":13},"Realising Costume Design for Performance",null,"Variety Performance",{"$f":"IF(COUNTIF('Ext Cert'!$E$20:$E$83,BQ13)>=1,\"\",ROW())","v":13},"Variety Performance",null,"Wardrobe for Stage Performance",{"$f":"IF(COUNTIF('Ext Cert'!$E$20:$E$83,BU13)>=1,\"\",ROW())","v":13},"Wardrobe for Stage Performance",null,"Performing Arts Enterprise",{"$f":"IF(COUNTIF('Ext Cert'!$E$20:$E$83,BY13)>=1,\"\",ROW())","v":13},"Performing Arts Enterprise",null,"Use of ICT in the Performing Arts",{"$f":"IF(COUNTIF('Ext Cert'!$E$20:$E$83,CC13)>=1,\"\",ROW())","v":13},"Use of ICT in the Performing Arts",null,"Wardrobe for Stage Performance",{"$f":"IF(COUNTIF('Ext Cert'!$E$20:$E$83,CG13)>=1,\"\",ROW())","v":13},"Wardrobe for Stage Performance",null,null,null,null,null,"Employability Skills in the Public Services",{"$f":"IF(COUNTIF('Ext Cert'!$E$20:$E$83,CO13)>=1,\"\",ROW())","v":13},"Employability Skills in the Public Services",null,"Designing Exercise Programmes",{"$f":"IF(COUNTIF('Ext Cert'!$E$20:$E$83,CS13)>=1,\"\",ROW())","v":13},"Designing Exercise Programmes",null,"UK Travel Agency Operations",{"$f":"IF(COUNTIF('Ext Cert'!$E$20:$E$83,CW13)>=1,\"\",ROW())","v":13},"UK Travel Agency Operations"]
["Electronics in Action",{"$f":"IF(COUNTIF('Ext Cert'!$E$20:$E$83,A14)>=1,\"\",ROW())","v":14},"Electronics in Action",null,"Art, Craft and Design in the Creative Industries",{"$f":"IF(COUNTIF('Ext Cert'!$E$20:$E$83,E14)>=1,\"\",ROW())","v":14},"Art, Craft and Design in the Creative Industries",null,null,null,null,null,null,null,null,null,"Editing Photographic Images",{"$f":"IF(COUNTIF('Ext Cert'!$E$20:$E$83,Q14)>=1,\"\",ROW())","v":14},"Editing Photographic Images",null,null,null,null,null,"Surface Design",{"$f":"IF(COUNTIF('Ext Cert'!$E$20:$E$83,Y14)>=1,\"\",ROW())","v":14},{"$f":"IF(ROW(Y14)-ROW(Y$2)+1>COUNT(Z$2:Z$50),\"\",INDEX(Y:Y,SMALL(Z$2:Z$50,1+ROW(Y14)-ROW(Y$2))))","v":"Surface Design"},null,"Moving Image Briefs",{"$f":"IF(COUNTIF('Ext Cert'!$E$20:$E$83,AC14)>=1,\"\",ROW())","v":14},"Moving Image Briefs",null,"Enhancing the Customer Experience",{"$f":"IF(COUNTIF('Ext Cert'!$E$20:$E$83,AG14)>=1,\"\",ROW())","v":14},"Enhancing the Customer Experience",null,"Brickwork and Blockwork Operations",{"$f":"IF(COUNTIF('Ext Cert'!$E$20:$E$83,AK14)>=1,\"\",ROW())","v":14},"Sustainability in Construction",null,"Welding",{"$f":"IF(COUNTIF('Ext Cert'!$E$20:$E$83,AO14)>=1,\"\",ROW())","v":14},"Welding",null,"Child Development and Observation",{"$f":"IF(COUNTIF('Ext Cert'!$E$20:$E$83,AS14)>=1,\"\",ROW())","v":14},"Child Development and Observation",null,"Delivering the Hospitality Customer Experience",{"$f":"IF(COUNTIF('Ext Cert'!$E$20:$E$83,AW14)>=1,\"\",ROW())","v":14},"Delivering the Hospitality Customer Experience",null,"Automated Computer Systems",{"$f":"IF(COUNTIF('Ext Cert'!$E$20:$E$83,BA14)>=1,\"\",ROW())","v":14},"Automated Computer Systems",null,"Developing Modern Music Production Skills",{"$f":"IF(COUNTIF('Ext Cert'!$E$20:$E$83,BE14)>=1,\"\",ROW())","v":14},"Developing Modern Music Production Skills",null,null,null,null,null,"Realising Set Design for Performance",{"$f":"IF(COUNTIF('Ext Cert'!$E$20:$E$83,BM14)>=1,\"\",ROW())","v":14},"Realising Set Design for Performance",null,"Performing Arts Enterprise",{"$f":"IF(COUNTIF('Ext Cert'!$E$20:$E$83,BQ14)>=1,\"\",ROW())","v":14},"Performing Arts Enterprise",null,"Use of ICT in the Performing Arts",{"$f":"IF(COUNTIF('Ext Cert'!$E$20:$E$83,BU14)>=1,\"\",ROW())","v":14},"Use of ICT in the Performing Arts",null,"Singing Skills in the Performing Arts",{"$f":"IF(COUNTIF('Ext Cert'!$E$20:$E$83,BY14)>=1,\"\",ROW())","v":14},"Singing Skills in the Performing Arts",null,"Work Experience in the Performing Arts",{"$f":"IF(COUNTIF('Ext Cert'!$E$20:$E$83,CC14)>=1,\"\",ROW())","v":14},"Work Experience in the Performing Arts",null,null,null,null,null,null,null,null,null,"Preparing to Respond to Emergency Incidents",{"$f":"IF(COUNTIF('Ext Cert'!$E$20:$E$83,CO14)>=1,\"\",ROW())","v":14},"Preparing to Respond to Emergency Incidents",null,"Expedition Experience",{"$f":"IF(COUNTIF('Ext Cert'!$E$20:$E$83,CS14)>=1,\"\",ROW())","v":14},"Expedition Experience",null,"The Cruise Industry",{"$f":"IF(COUNTIF('Ext Cert'!$E$20:$E$83,CW14)>=1,\"\",ROW())","v":14},"The Cruise Industry"]
["Biotechnology Procedures and Applications",{"$f":"IF(COUNTIF('Ext Cert'!$E$20:$E$83,A15)>=1,\"\",ROW())","v":15},"Biotechnology Procedures and Applications",null,"3D Design Briefs",{"$f":"IF(OR(COUNTIF('Ext Cert'!$E$20:$E$83,E15)>=1,COUNTIF('Ext Cert'!$E$20:$E$83,E3)>=1),\"\",ROW())","v":15},"3D Design Briefs",null,null,null,null,null,null,null,null,null,null,null,null,null,null,null,null,null,"Sculpture",{"$f":"IF(COUNTIF('Ext Cert'!$E$20:$E$83,Y15)>=1,\"\",ROW())","v":15},{"$f":"IF(ROW(Y15)-ROW(Y$2)+1>COUNT(Z$2:Z$50),\"\",INDEX(Y:Y,SMALL(Z$2:Z$50,1+ROW(Y15)-ROW(Y$2))))","v":"Sculpture"},null,"Printmaking Briefs",{"$f":"IF(COUNTIF('Ext Cert'!$E$20:$E$83,AC15)>=1,\"\",ROW())","v":15},"Printmaking Briefs",null,"Visual Merchandising in Retail Business",{"$f":"IF(COUNTIF('Ext Cert'!$E$20:$E$83,AG15)>=1,\"\",ROW())","v":15},"Visual Merchandising in Retail Business",null,"Painting and Paperhanging Operations",{"$f":"IF(COUNTIF('Ext Cert'!$E$20:$E$83,AK15)>=1,\"\",ROW())","v":15},"Exploring Roofing Principles and Techniques",null,"Computer Numerical Control Programming",{"$f":"IF(COUNTIF('Ext Cert'!$E$20:$E$83,AO15)>=1,\"\",ROW())","v":15},"Computer Numerical Control Programming",null,"An Introduction to Basic First Aid",{"$f":"IF(COUNTIF('Ext Cert'!$E$20:$E$83,AS15)>=1,\"\",ROW())","v":15},"An Introduction to Basic First Aid",null,"Work Experience in Hospitality",{"$f":"IF(COUNTIF('Ext Cert'!$E$20:$E$83,AW15)>=1,\"\",ROW())","v":15},"Work Experience in Hospitality",null,"Multimedia Products Development",{"$f":"IF(COUNTIF('Ext Cert'!$E$20:$E$83,BA15)>=1,\"\",ROW())","v":15},"Multimedia Products Development",null,"Developing Music Theory",{"$f":"IF(COUNTIF('Ext Cert'!$E$20:$E$83,BE15)>=1,\"\",ROW())","v":15},"Developing Music Theory",null,null,null,null,null,"Realising Prop Design for Performance",{"$f":"IF(COUNTIF('Ext Cert'!$E$20:$E$83,BM15)>=1,\"\",ROW())","v":15},"Realising Prop Design for Performance",null,"Use of ICT in the Performing Arts",{"$f":"IF(COUNTIF('Ext Cert'!$E$20:$E$83,BQ15)>=1,\"\",ROW())","v":15},"Use of ICT in the Performing Arts",null,"Work Experience in the Performing Arts",{"$f":"IF(COUNTIF('Ext Cert'!$E$20:$E$83,BU15)>=1,\"\",ROW())","v":15},"Work Experience in the Performing Arts",null,null,null,null,null,null,null,null,null,null,null,null,null,null,null,null,null,"Security Procedures in the Public Services",{"$f":"IF(COUNTIF('Ext Cert'!$E$20:$E$83,CO15)>=1,\"\",ROW())","v":15},"Security Procedures in the Public Services",null,"Practical Land-based Outdoor and Adventurous Activities",{"$f":"IF(COUNTIF('Ext Cert'!$E$20:$E$83,CS15)>=1,\"\",ROW())","v":15},"Practical Land-based Outdoor and Adventurous Activities",null,"Hospitality Operations in the Travel and Tourism Sector",{"$f":"IF(COUNTIF('Ext Cert'!$E$20:$E$83,CW15)>=1,\"\",ROW())","v":15},"Hospitality Operations in the Travel and Tourism Sector"]
["Further Chemistry",{"$f":"IF(COUNTIF('Ext Cert'!$E$20:$E$83,A16)>=1,\"\",ROW())","v":16},"Further Chemistry",null,"Digital Art and Design Briefs",{"$f":"IF(COUNTIF('Ext Cert'!$E$20:$E$83,E16)>=1,\"\",ROW())","v":16},"Digital Art and Design Briefs",null,null,null,null,null,null,null,null,null,null,null,null,null,null,null,null,null,null,null,null,null,"Drawing from Observation",{"$f":"IF(COUNTIF('Ext Cert'!$E$20:$E$83,AC16)>=1,\"\",ROW())","v":16},"Drawing from Observation",null,"Small Business Planning",{"$f":"IF(COUNTIF('Ext Cert'!$E$20:$E$83,AG16)>=1,\"\",ROW())","v":16},"Small Business Planning",null,"Plumbing Operations",{"$f":"IF(COUNTIF('Ext Cert'!$E$20:$E$83,AK16)>=1,\"\",ROW())","v":16},"Exploring Wall and Floor Tiling Principles and Techniques",null,"Bicycle Servicing and Maintenance",{"$f":"IF(COUNTIF('Ext Cert'!$E$20:$E$83,AO16)>=1,\"\",ROW())","v":16},"Bicycle Servicing and Maintenance",null,"Food Safety in Health and Social Care",{"$f":"IF(COUNTIF('Ext Cert'!$E$20:$E$83,AS16)>=1,\"\",ROW())","v":16},"Food Safety in Health and Social Care",null,"Barista Skills in Hospitality",{"$f":"IF(COUNTIF('Ext Cert'!$E$20:$E$83,AW16)>=1,\"\",ROW())","v":16},"Barista Skills in Hospitality",null,"Computational Thinking",{"$f":"IF(COUNTIF('Ext Cert'!$E$20:$E$83,BA16)>=1,\"\",ROW())","v":16},"Computational Thinking",null,"Music Fusion",{"$f":"IF(COUNTIF('Ext Cert'!$E$20:$E$83,BE16)>=1,\"\",ROW())","v":16},"Music Fusion",null,null,null,null,null,"Realising Mask Design for Performance",{"$f":"IF(COUNTIF('Ext Cert'!$E$20:$E$83,BM16)>=1,\"\",ROW())","v":16},"Realising Mask Design for Performance",null,"Work Experience in the Performing Arts",{"$f":"IF(COUNTIF('Ext Cert'!$E$20:$E$83,BQ16)>=1,\"\",ROW())","v":16},"Work Experience in the Performing Arts",null,null,null,null,null,null,null,null,null,null,null,null,null,null,null,null,null,null,null,null,null,"Carrying out a Project in Public Services",{"$f":"IF(COUNTIF('Ext Cert'!$E$20:$E$83,CO16)>=1,\"\",ROW())","v":16},"Carrying out a Project in Public Services",null,"Practical Water-based Outdoor and Adventurous Activities",{"$f":"IF(COUNTIF('Ext Cert'!$E$20:$E$83,CS16)>=1,\"\",ROW())","v":16},"Practical Water-based Outdoor and Adventurous Activities",null,"UK Visitor Attractions",{"$f":"IF(COUNTIF('Ext Cert'!$E$20:$E$83,CW16)>=1,\"\",ROW())","v":16},"UK Visitor Attractions"]
["Further Physics",{"$f":"IF(COUNTIF('Ext Cert'!$E$20:$E$83,A17)>=1,\"\",ROW())","v":17},"Further Physics",null,"Interactive Media Production Briefs",{"$f":"IF(COUNTIF('Ext Cert'!$E$20:$E$83,E17)>=1,\"\",ROW())","v":17},"Interactive Media Production Briefs",null,null,null,null,null,null,null,null,null,null,null,null,null,null,null,null,null,null,null,null,null,"Ceramics",{"$f":"IF(COUNTIF('Ext Cert'!$E$20:$E$83,AC17)>=1,\"\",ROW())","v":17},"Ceramics",null,"Introducing Project Management",{"$f":"IF(COUNTIF('Ext Cert'!$E$20:$E$83,AG17)>=1,\"\",ROW())","v":17},"Introducing Project Management",null,"Electrical Operations",{"$f":"IF(COUNTIF('Ext Cert'!$E$20:$E$83,AK17)>=1,\"\",ROW())","v":17},"Exploring Plastering and Dry Lining Principles and Techniques",null,"Sustainable Vehicle Power and Structure Design",{"$f":"IF(COUNTIF('Ext Cert'!$E$20:$E$83,AO17)>=1,\"\",ROW())","v":17},"Sustainable Vehicle Power and Structure Design",null,"Infection Control in Health and Social Care",{"$f":"IF(COUNTIF('Ext Cert'!$E$20:$E$83,AS17)>=1,\"\",ROW())","v":17},"Infection Control in Health and Social Care",null,null,null,null,null,"Computing in the Workplace",{"$f":"IF(COUNTIF('Ext Cert'!$E$20:$E$83,BA17)>=1,\"\",ROW())","v":17},"Computing in the Workplace",null,"Music Arrangement",{"$f":"IF(COUNTIF('Ext Cert'!$E$20:$E$83,BE17)>=1,\"\",ROW())","v":17},"Music Arrangement",null,null,null,null,null,"Lighting for Performance",{"$f":"IF(COUNTIF('Ext Cert'!$E$20:$E$83,BM17)>=1,\"\",ROW())","v":17},"Lighting for Performance",null,"Singing Skills in the Performing Arts",{"$f":"IF(COUNTIF('Ext Cert'!$E$20:$E$83,BQ17)>=1,\"\",ROW())","v":17},"Singing Skills in the Performing Arts",null,null,null,null,null,null,null,null,null,null,null,null,null,null,null,null,null,null,null,null,null,"Law and its Impact on the Individual",{"$f":"IF(COUNTIF('Ext Cert'!$E$20:$E$83,CO17)>=1,\"\",ROW())","v":17},"Law and its Impact on the Individual",null,"Land-based Outdoor and Adventurous Activity Leadership",{"$f":"IF(COUNTIF('Ext Cert'!$E$20:$E$83,CS17)>=1,\"\",ROW())","v":17},"Land-based Outdoor and Adventurous Activity Leadership"]
[null,null,null,null,"Painting Briefs",{"$f":"IF(OR(COUNTIF('Ext Cert'!$E$20:$E$83,E18)>=1,COUNTIF('Ext Cert'!$E$20:$E$83,E2)>=1),\"\",ROW())","v":18},"Painting Briefs",null,null,null,null,null,null,null,null,null,null,null,null,null,null,null,null,null,null,null,null,null,"Sustainability in Art and Design Practice",{"$f":"IF(COUNTIF('Ext Cert'!$E$20:$E$83,AC18)>=1,\"\",ROW())","v":18},"Sustainability in Art and Design Practice",null,"Delivering and Improving Customer Service",{"$f":"IF(COUNTIF('Ext Cert'!$E$20:$E$83,AG18)>=1,\"\",ROW())","v":18},"Delivering and Improving Customer Service",null,"Tendering and Estimating",{"$f":"IF(COUNTIF('Ext Cert'!$E$20:$E$83,AK18)>=1,\"\",ROW())","v":18},"Carpentry and Joinery Operations",null,null,null,null,null,null,null,null,null,null,null,null,null,"Building a Personal Computer",{"$f":"IF(COUNTIF('Ext Cert'!$E$20:$E$83,BA18)>=1,\"\",ROW())","v":18},"Building a Personal Computer",null,"Exploring Music Improvisation",{"$f":"IF(COUNTIF('Ext Cert'!$E$20:$E$83,BE18)>=1,\"\",ROW())","v":18},"Exploring Music Improvisation",null,null,null,null,null,"Sound for Performance",{"$f":"IF(COUNTIF('Ext Cert'!$E$20:$E$83,BM18)>=1,\"\",ROW())","v":18},"Sound for Performance",null,null,null,null,null,null,null,null,null,null,null,null,null,null,null,null,null,null,null,null,null,null,null,null,null,null,null,null,null,"Water-based Outdoor and Adventurous Activity Leadership",{"$f":"IF(COUNTIF('Ext Cert'!$E$20:$E$83,CS18)>=1,\"\",ROW())","v":18},"Water-based Outdoor and Adventurous Activity Leadership"]
[null,null,null,null,"Designing Products",{"$f":"IF(OR(COUNTIF('Ext Cert'!$E$20:$E$83,E19)>=1,COUNTIF('Ext Cert'!$E$20:$E$83,E3)>=1),\"\",ROW())","v":19},"Designing Products",null,null,null,null,null,null,null,null,null,null,null,null,null,null,null,null,null,null,null,null,null,"Modelmaking",{"$f":"IF(COUNTIF('Ext Cert'!$E$20:$E$83,AC19)>=1,\"\",ROW())","v":19},"Modelmaking",null,"Effective Business Communication",{"$f":"IF(COUNTIF('Ext Cert'!$E$20:$E$83,AG19)>=1,\"\",ROW())","v":19},"Effective Business Communication",null,"Exploring Surveying",{"$f":"IF(COUNTIF('Ext Cert'!$E$20:$E$83,AK19)>=1,\"\",ROW())","v":19},"Brickwork and Blockwork Operations",null,null,null,null,null,null,null,null,null,null,null,null,null,"A Technology Business",{"$f":"IF(COUNTIF('Ext Cert'!$E$20:$E$83,BA19)>=1,\"\",ROW())","v":19},"A Technology Business",null,"Exploring DJing",{"$f":"IF(COUNTIF('Ext Cert'!$E$20:$E$83,BE19)>=1,\"\",ROW())","v":19},"Exploring DJing",null,null,null,null,null,"Supporting Performance: Stage Management",{"$f":"IF(COUNTIF('Ext Cert'!$E$20:$E$83,BM19)>=1,\"\",ROW())","v":19},"Supporting Performance: Stage Management",null,null,null,null,null,null,null,null,null,null,null,null,null,null,null,null,null,null,null,null,null,null,null,null,null,null,null,null,null,"Work Experience in Sport",{"$f":"IF(COUNTIF('Ext Cert'!$E$20:$E$83,CS19)>=1,\"\",ROW())","v":19},"Work Experience in Sport"]
[null,null,null,null,"Practical Research Project in Art and Design",{"$f":"IF(COUNTIF('Ext Cert'!$E$20:$E$83,E20)>=1,\"\",ROW())","v":20},"Practical Research Project in Art and Design",null,null,null,null,null,null,null,null,null,null,null,null,null,null,null,null,null,null,null,null,null,"Sculpture",{"$f":"IF(OR(COUNTIF('Ext Cert'!$E$20:$E$83,AC20)>=1,COUNTIF('Ext Cert'!$E$20:$E$83,AC2)>=1),\"\",ROW())","v":20},"Sculpture",null,"Working in Business Teams",{"$f":"IF(COUNTIF('Ext Cert'!$E$20:$E$83,AG20)>=1,\"\",ROW())","v":20},"Working in Business Teams",null,"Exploring Civil Engineering",{"$f":"IF(COUNTIF('Ext Cert'!$E$20:$E$83,AK20)>=1,\"\",ROW())","v":20},"Painting and Paperhanging Operations",null,null,null,null,null,null,null,null,null,null,null,null,null,"Computer Security in Practice",{"$f":"IF(COUNTIF('Ext Cert'!$E$20:$E$83,BA20)>=1,\"\",ROW())","v":20},"Computer Security in Practice",null,"Music Promotion",{"$f":"IF(COUNTIF('Ext Cert'!$E$20:$E$83,BE20)>=1,\"\",ROW())","v":20},"Music Promotion",null,null,null,null,null,"Supporting Performance: Front of House",{"$f":"IF(COUNTIF('Ext Cert'!$E$20:$E$83,BM20)>=1,\"\",ROW())","v":20},"Supporting Performance: Front of House"]
[null,null,null,null,"Design Thinking",{"$f":"IF(COUNTIF('Ext Cert'!$E$20:$E$83,E21)>=1,\"\",ROW())","v":21},"Design Thinking",null,null,null,null,null,null,null,null,null,null,null,null,null,null,null,null,null,null,null,null,null,null,null,null,null,"Planning, Forecasting and Recording Business Finances",{"$f":"IF(COUNTIF('Ext Cert'!$E$20:$E$83,AG21)>=1,\"\",ROW())","v":21},"Planning, Forecasting and Recording Business Finances",null,"Exploring Building Services Engineering",{"$f":"IF(COUNTIF('Ext Cert'!$E$20:$E$83,AK21)>=1,\"\",ROW())","v":21},"Plumbing Operations",null,null,null,null,null,null,null,null,null,null,null,null,null,"Computer Systems Support in Practice",{"$f":"IF(COUNTIF('Ext Cert'!$E$20:$E$83,BA21)>=1,\"\",ROW())","v":21},"Computer Systems Support in Practice",null,"Digital and Mobile Technology for Music",{"$f":"IF(COUNTIF('Ext Cert'!$E$20:$E$83,BE21)>=1,\"\",ROW())","v":21},"Digital and Mobile Technology for Music",null,null,null,null,null,"Make-up for Performance",{"$f":"IF(COUNTIF('Ext Cert'!$E$20:$E$83,BM21)>=1,\"\",ROW())","v":21},"Make-up for Performance"]
[null,null,null,null,"Fashion Promotion",{"$f":"IF(COUNTIF('Ext Cert'!$E$20:$E$83,E22)>=1,\"\",ROW())","v":22},"Fashion Promotion",null,null,null,null,null,null,null,null,null,null,null,null,null,null,null,null,null,null,null,null,null,null,null,null,null,"Work Experience in Business",{"$f":"IF(OR(COUNTIF('Ext Cert'!$E$20:$E$83,AG22)>=1,COUNTIF('Ext Cert'!$E$20:$E$83,AG7)>=1),\"\",ROW())","v":22},"Work Experience in Business",null,"Exploring Facilities Management",{"$f":"IF(COUNTIF('Ext Cert'!$E$20:$E$83,AK22)>=1,\"\",ROW())","v":22},"Electrical Operations",null,null,null,null,null,null,null,null,null,null,null,null,null,"Software Systems Development",{"$f":"IF(COUNTIF('Ext Cert'!$E$20:$E$83,BA22)>=1,\"\",ROW())","v":22},"Software Systems Development",null,"Composing for Visual Media",{"$f":"IF(COUNTIF('Ext Cert'!$E$20:$E$83,BE22)>=1,\"\",ROW())","v":22},"Composing for Visual Media",null,null,null,null,null,"Wardrobe for Stage Performance",{"$f":"IF(COUNTIF('Ext Cert'!$E$20:$E$83,BM22)>=1,\"\",ROW())","v":22},"Wardrobe for Stage Performance"]
[null,null,null,null,"Moving Image Briefs",{"$f":"IF(COUNTIF('Ext Cert'!$E$20:$E$83,E23)>=1,\"\",ROW())","v":23},"Moving Image Briefs",null,null,null,null,null,null,null,null,null,null,null,null,null,null,null,null,null,null,null,null,null,null,null,null,null,"Introducing International Business",{"$f":"IF(COUNTIF('Ext Cert'!$E$20:$E$83,AG23)>=1,\"\",ROW())","v":23},"Introducing International Business",null,null,null,null,null,null,null,null,null,null,null,null,null,null,null,null,null,"IT Work Experience",{"$f":"IF(COUNTIF('Ext Cert'!$E$20:$E$83,BA23)>=1,\"\",ROW())","v":23},{"$f":"IF(ROW(BA23)-ROW(BA$2)+1>COUNT(BB$2:BB$50),\"\",INDEX(BA:BA,SMALL(BB$2:BB$50,1+ROW(BA23)-ROW(BA$2))))","v":"IT Work Experience"},null,"Enterprise and Music",{"$f":"IF(COUNTIF('Ext Cert'!$E$20:$E$83,BE23)>=1,\"\",ROW())","v":23},"Enterprise and Music",null,null,null,null,null,"Choreographing Dance",{"$f":"IF(COUNTIF('Ext Cert'!$E$20:$E$83,BM23)>=1,\"\",ROW())","v":23},"Choreographing Dance"]
[null,null,null,null,"Interaction Design",{"$f":"IF(COUNTIF('Ext Cert'!$E$20:$E$83,E24)>=1,\"\",ROW())","v":24},"Interaction Design",null,null,null,null,null,null,null,null,null,null,null,null,null,null,null,null,null,null,null,null,null,null,null,null,null,"Introducing the Economic Environment",{"$f":"IF(COUNTIF('Ext Cert'!$E$20:$E$83,AG24)>=1,\"\",ROW())","v":24},"Introducing the Economic Environment",null,null,null,null,null,null,null,null,null,null,null,null,null,null,null,null,null,null,null,null,null,"Professional Skills in Music",{"$f":"IF(COUNTIF('Ext Cert'!$E$20:$E$83,BE24)>=1,\"\",ROW())","v":24},"Professional Skills in Music",null,null,null,null,null,"Community Arts",{"$f":"IF(COUNTIF('Ext Cert'!$E$20:$E$83,BM24)>=1,\"\",ROW())","v":24},"Community Arts"]
[null,null,null,null,"Printmaking Briefs",{"$f":"IF(COUNTIF('Ext Cert'!$E$20:$E$83,E25)>=1,\"\",ROW())","v":25},"Printmaking Briefs",null,null,null,null,null,null,null,null,null,null,null,null,null,null,null,null,null,null,null,null,null,null,null,null,null,"Efficient Business Operations",{"$f":"IF(COUNTIF('Ext Cert'!$E$20:$E$83,AG25)>=1,\"\",ROW())","v":25},"Efficient Business Operations",null,null,null,null,null,null,null,null,null,null,null,null,null,null,null,null,null,null,null,null,null,null,null,null,null,null,null,null,null,"Directing Performance",{"$f":"IF(COUNTIF('Ext Cert'!$E$20:$E$83,BM25)>=1,\"\",ROW())","v":25},"Directing Performance"]
[null,null,null,null,"Drawing from Observation",{"$f":"IF(COUNTIF('Ext Cert'!$E$20:$E$83,E26)>=1,\"\",ROW())","v":26},"Drawing from Observation",null,null,null,null,null,null,null,null,null,null,null,null,null,null,null,null,null,null,null,null,null,null,null,null,null,"Principles of Procurement and Supply",{"$f":"IF(COUNTIF('Ext Cert'!$E$20:$E$83,AG26)>=1,\"\",ROW())","v":26},"Principles of Procurement and Supply",null,null,null,null,null,null,null,null,null,null,null,null,null,null,null,null,null,null,null,null,null,null,null,null,null,null,null,null,null,"Planning and Managing a Performing Arts Event",{"$f":"IF(COUNTIF('Ext Cert'!$E$20:$E$83,BM26)>=1,\"\",ROW())","v":26},"Planning and Managing a Performing Arts Event"]
[null,null,null,null,"Ceramics",{"$f":"IF(COUNTIF('Ext Cert'!$E$20:$E$83,E27)>=1,\"\",ROW())","v":27},"Ceramics",null,null,null,null,null,null,null,null,null,null,null,null,null,null,null,null,null,null,null,null,null,null,null,null,null,"Implementing Procurement and Supply in Business",{"$f":"IF(COUNTIF('Ext Cert'!$E$20:$E$83,AG27)>=1,\"\",ROW())","v":27},"Implementing Procurement and Supply in Business",null,null,null,null,null,null,null,null,null,null,null,null,null,null,null,null,null,null,null,null,null,null,null,null,null,null,null,null,null,"Multimedia Production",{"$f":"IF(COUNTIF('Ext Cert'!$E$20:$E$83,BM27)>=1,\"\",ROW())","v":27},"Multimedia Production"]
[null,null,null,null,"Studio Photography",{"$f":"IF(COUNTIF('Ext Cert'!$E$20:$E$83,E28)>=1,\"\",ROW())","v":28},"Studio Photography",null,null,null,null,null,null,null,null,null,null,null,null,null,null,null,null,null,null,null,null,null,null,null,null,null,"Corporate Social Responsibility",{"$f":"IF(COUNTIF('Ext Cert'!$E$20:$E$83,AG28)>=1,\"\",ROW())","v":28},"Corporate Social Responsibility",null,null,null,null,null,null,null,null,null,null,null,null,null,null,null,null,null,null,null,null,null,null,null,null,null,null,null,null,null,"Physical Theatre Performance",{"$f":"IF(COUNTIF('Ext Cert'!$E$20:$E$83,BM28)>=1,\"\",ROW())","v":28},"Physical Theatre Performance"]
[null,null,null,null,"Location Photography",{"$f":"IF(COUNTIF('Ext Cert'!$E$20:$E$83,E29)>=1,\"\",ROW())","v":29},"Location Photography",null,null,null,null,null,null,null,null,null,null,null,null,null,null,null,null,null,null,null,null,null,null,null,null,null,"Managing Personal Finances",{"$f":"IF(COUNTIF('Ext Cert'!$E$20:$E$83,AG29)>=1,\"\",ROW())","v":29},"Managing Personal Finances",null,null,null,null,null,null,null,null,null,null,null,null,null,null,null,null,null,null,null,null,null,null,null,null,null,null,null,null,null,"Variety Performance",{"$f":"IF(COUNTIF('Ext Cert'!$E$20:$E$83,BM29)>=1,\"\",ROW())","v":29},"Variety Performance"]
[null,null,null,null,"Designing for Print and Screen",{"$f":"IF(COUNTIF('Ext Cert'!$E$20:$E$83,E30)>=1,\"\",ROW())","v":30},"Designing for Print and Screen",null,null,null,null,null,null,null,null,null,null,null,null,null,null,null,null,null,null,null,null,null,null,null,null,null,"Sustainability in the Business Workplace",{"$f":"IF(COUNTIF('Ext Cert'!$E$20:$E$83,AG30)>=1,\"\",ROW())","v":30},"Sustainability in the Business Workplace",null,null,null,null,null,null,null,null,null,null,null,null,null,null,null,null,null,null,null,null,null,null,null,null,null,null,null,null,null,"Performing Arts Enterprise",{"$f":"IF(COUNTIF('Ext Cert'!$E$20:$E$83,BM30)>=1,\"\",ROW())","v":30},"Performing Arts Enterprise"]
[null,null,null,null,"Editing Photographic Images",{"$f":"IF(COUNTIF('Ext Cert'!$E$20:$E$83,E31)>=1,\"\",ROW())","v":31},"Editing Photographic Images",null,null,null,null,null,null,null,null,null,null,null,null,null,null,null,null,null,null,null,null,null,null,null,null,null,null,null,null,null,null,null,null,null,null,null,null,null,null,null,null,null,null,null,null,null,null,null,null,null,null,null,null,null,null,null,null,null,"Use of ICT in the Performing Arts",{"$f":"IF(COUNTIF('Ext Cert'!$E$20:$E$83,BM31)>=1,\"\",ROW())","v":31},"Use of ICT in the Performing Arts"]
[null,null,null,null,"Fashion Retail",{"$f":"IF(COUNTIF('Ext Cert'!$E$20:$E$83,E32)>=1,\"\",ROW())","v":32},"Fashion Retail",null,null,null,null,null,null,null,null,null,null,null,null,null,null,null,null,null,null,null,null,null,null,null,null,null,null,null,null,null,null,null,null,null,null,null,null,null,null,null,null,null,null,null,null,null,null,null,null,null,null,null,null,null,null,null,null,null,"Work Experience in the Performing Arts",{"$f":"IF(COUNTIF('Ext Cert'!$E$20:$E$83,BM32)>=1,\"\",ROW())","v":32},"Work Experience in the Performing Arts"]
[null,null,null,null,"Surface Design",{"$f":"IF(COUNTIF('Ext Cert'!$E$20:$E$83,E33)>=1,\"\",ROW())","v":33},"Surface Design",null,null,null,null,null,null,null,null,null,null,null,null,null,null,null,null,null,null,null,null,null,null,null,null,null,null,null,null,null,null,null,null,null,null,null,null,null,null,null,null,null,null,null,null,null,null,null,null,null,null,null,null,null,null,null,null,null,"Singing Skills in the Performing Arts",{"$f":"IF(COUNTIF('Ext Cert'!$E$20:$E$83,BM33)>=1,\"\",ROW())","v":33},"Singing Skills in the Performing Arts"]
[null,null,null,null,"Sustainability in Art and Design Practice",{"$f":"IF(COUNTIF('Ext Cert'!$E$20:$E$83,E34)>=1,\"\",ROW())","v":34},"Sustainability in Art and Design Practice"]
[null,null,null,null,"Advertising Briefs",{"$f":"IF(COUNTIF('Ext Cert'!$E$20:$E$83,E35)>=1,\"\",ROW())","v":35},"Advertising Briefs"]
[null,null,null,null,"Modelmaking",{"$f":"IF(COUNTIF('Ext Cert'!$E$20:$E$83,E36)>=1,\"\",ROW())","v":36},"Modelmaking"]
[null,null,null,null,"Sculpture",{"$f":"IF(OR(COUNTIF('Ext Cert'!$E$20:$E$83,E37)>=1,COUNTIF('Ext Cert'!$E$20:$E$83,E3)>=1),\"\",ROW())","v":37},"Sculpture"]
[]
[null,null,null,null,null,null,null,null,null,null,null,null,null,null,null,null,null,null,null,null,null,null,null,null,null,null,null,null,null,null,null,null,null,null,null,null,"Unit 6","Unit 16","Forbidden",null,null,null,null,null,null,null,null,null,"Unit 6",null,"Unit 13","Forbidden"]
[null,null,null,null,null,null,null,null,null,null,null,null,null,null,null,null,null,null,null,null,null,null,null,null,null,null,null,null,null,null,null,null,null,null,null,null,{"$f":"COUNTIF('Ext Cert'!$E$20:$E$25, \"Exploring Carpentry and Joinery Principles and Techniques\")","v":0},{"$f":"COUNTIF('Ext Cert'!$E$20:$E$25, \"Carpentry and Joinery Operations\")","v":0},{"$f":"IF(AND(AK40=0,AL40=1),1,0)","v":0},null,null,null,null,null,null,null,null,null,{"$f":"COUNTIF('Ext Cert'!$E$20:$E$27, \"Planning, Preparing, Cooking and Finishing Food\")","v":0},null,{"$f":"COUNTIF('Ext Cert'!$E$20:$E$27, \"Contemporary World Food Cooking Skills\")","v":0},{"$f":"IF(AND(AW40=0,AY40=1),1,0)","v":0}]
[null,null,null,null,null,null,null,null,null,null,null,null,null,null,null,null,null,null,null,null,null,null,null,null,null,null,null,null,null,null,null,null,null,null,null,null,"Unit 7","Unit 17",null,null,null,null,null,null,null,null,null,null,"Unit 4",null,"Unit 16","Forbidden"]
[null,null,null,null,null,null,null,null,null,null,null,null,null,null,null,null,null,null,null,null,null,null,null,null,null,null,null,null,null,null,null,null,null,null,null,null,{"$f":"COUNTIF('Ext Cert'!$E$20:$E$25, \"Exploring Brickwork and Blockwork Principles and Techniques\")","v":0},{"$f":"COUNTIF('Ext Cert'!$E$20:$E$25, \"Brickwork and Blockwork Operations\")","v":0},{"$f":"IF(AND(AK42=0,AL42=1),1,0)","v":0},null,null,null,null,null,null,null,null,null,{"$f":"COUNTIF('Ext Cert'!$E$20:$E$27, \"Costing and Controlling Finances in the Hospitality Industry\")","v":0},null,{"$f":"COUNTIF('Ext Cert'!$E$20:$E$27, \"Managing Finance in Hospitality\")","v":0},{"$f":"IF(AND(AW42=0,AY42=1),1,0)","v":0}]
[null,null,null,null,null,null,null,null,null,null,null,null,null,null,null,null,null,null,null,null,null,null,null,null,null,null,null,null,null,null,null,null,null,null,null,null,"Unit 8","Unit 18"]
[null,null,null,null,null,null,null,null,null,null,null,null,null,null,null,null,null,null,null,null,null,null,null,null,null,null,null,null,null,null,null,null,null,null,null,null,{"$f":"COUNTIF('Ext Cert'!$E$20:$E$25, \"Exploring Painting and Decorating Principles and Techniques\")","v":0},{"$f":"COUNTIF('Ext Cert'!$E$20:$E$25, \"Painting and Paperhanging Operations\")","v":0},{"$f":"IF(AND(AK44=0,AL44=1),1,0)","v":0}]
[null,null,null,null,null,null,null,null,null,null,null,null,null,null,null,null,null,null,null,null,null,null,null,null,null,null,null,null,null,null,null,null,null,null,null,null,"Unit 9","Unit 19"]
[null,null,null,null,null,null,null,null,null,null,null,null,null,null,null,null,null,null,null,null,null,null,null,null,null,null,null,null,null,null,null,null,null,null,null,null,{"$f":"COUNTIF('Ext Cert'!$E$20:$E$25, \"Exploring Plumbing Principles and Techniques\")","v":0},{"$f":"COUNTIF('Ext Cert'!$E$20:$E$25, \"Plumbing Operations\")","v":0},{"$f":"IF(AND(AK46=0,AL46=1),1,0)","v":0}]
[null,null,null,null,null,null,null,null,null,null,null,null,null,null,null,null,null,null,null,null,null,null,null,null,null,null,null,null,null,null,null,null,null,null,null,null,"Unit 10","Unit 20"]
[null,null,null,null,null,null,null,null,null,null,null,null,null,null,null,null,null,null,null,null,null,null,null,null,null,null,null,null,null,null,null,null,null,null,null,null,{"$f":"COUNTIF('Ext Cert'!$E$20:$E$25, \"Exploring Electrical Principles and Techniques\")","v":0},{"$f":"COUNTIF('Ext Cert'!$E$20:$E$25, \"Electrical Operations\")","v":0},{"$f":"IF(AND(AK48=0,AL48=1),1,0)","v":0}]

{"sheet":"Sectors","index":13,"n_rows":32,"n_cols":4,"rows_kept":32,"cut":false,"hidden":true,"merged":[]}
["Award","Cert","Ext Cert","Dip"]
["Application of Science","Art and Design","Applied Science","Applied Science"]
["Principles of Applied Science","Art and Design Design Crafts","Art and Design","Art and Design"]
["Art and Design","Art and Design Fashion and Textiles","Art and Design Design Crafts","Art and Design Design Crafts"]
["Business 2012","Art and Design Photography","Art and Design Fashion and Textiles","Art and Design Fashion and Textiles"]
["Business 2018","Art and Design Product Design","Art and Design Photography","Art and Design Photography"]
["Construction and the Built Environment 2013","Art and Design Visual Arts","Art and Design Product Design","Art and Design Product Design"]
["Construction and the Built Environment 2018","Art and Design Visual Communication","Art and Design Visual Arts","Art and Design Visual Arts"]
["CPLD","Business","Art and Design Visual Communication","Art and Design Visual Communication"]
["Creative Digital Media Production","Construction and the Built Environment","Business","Business"]
["Engineering","CPLD","Construction and the Built Environment","Construction and the Built Environment"]
["Engineering Design and Product Investigation","Creative Digital Media Production","Creative Digital Media Production","Creative Digital Media Production"]
["Engineering Electronics and Computer Control Technologies","Engineering","Engineering","Engineering"]
["Engineering Materials and Manufacturing","Health and Social Care","Health and Social Care","Engineering Technology"]
["Equine Studies","Hospitality","Hospitality","Engineering Maintenance"]
["Health and Social Care","Information and Creative Technology","Information and Creative Technology","Engineering Manufacturing"]
["Hospitality","Music","Music","Engineering Mechanical"]
["Information and Creative Technology","Performing Arts Acting","Performing Arts","Health and Social Care"]
["Music","Performing Arts Dance","Performing Arts Acting","Hospitality"]
["Performing Arts","Performing Arts Musical Theatre","Performing Arts Dance","Information and Creative Technology"]
["Public Services","Performing Arts Production","Performing Arts Production","Information and Creative Technology Computer Science"]
["Sport 2012","Public Services","Public Services","Information and Creative Technology Systems Development and Support"]
["Sport 2018","Sport","Sport","Music"]
["Travel and Tourism 2013","Travel and Tourism","Travel and Tourism","Performing Arts"]
["Travel and Tourism 2018",null,null,"Performing Arts Acting"]
[null,null,null,"Performing Arts Dance"]
[null,null,null,"Performing Arts Production"]
[null,null,null,"Public Services"]
[null,null,null,"Sport"]
[null,null,null,"Sport Outdoor and Adventurous Activities"]
[null,null,null,"Sport Fitness and Exercise"]
[null,null,null,"Travel and Tourism"]

{"sheet":"Points","index":14,"n_rows":10,"n_cols":15,"rows_kept":10,"cut":false,"hidden":true,"merged":[]}
[null,null,null,null,"Award",null,null,"Cert",null,null,"Ext Cert",null,null,"Dip"]
["U",0,"U",null,0,"U",null,0,"U",null,0,"U",null,0,"U"]
["L1P",2,"L1P",null,24,"Level 1",null,48,"Level 1",null,72,"Level 1",null,96,"Level 1"]
["L2P",4,"L2P",null,48,"P",null,96,"PP",null,144,"PP",null,192,"PP"]
["L2M",6,"L2M",null,66,"M",null,114,"MP",null,174,"MP",null,234,"MP"]
["L2D",8,"L2D",null,84,"D",null,132,"MM",null,204,"MM",null,276,"MM"]
[null,null,null,null,90,"D*",null,150,"DM",null,234,"DM",null,318,"DM"]
[null,null,null,null,null,null,null,168,"DD",null,264,"DD",null,360,"DD"]
[null,null,null,null,null,null,null,174,"D*D",null,270,"D*D",null,366,"D*D"]
[null,null,null,null,null,null,null,180,"D*D*",null,276,"D*D*",null,372,"D*D*"]